test_aggregation_absolute

./temporal/t.rast.aggregate – test_aggregation_absolute

Test failed

Testtest_aggregation_absolute
Testsuite./temporal/t.rast.aggregate
Test file./temporal/t.rast.aggregate/testsuite/test_aggregation_absolute.py
StatusFAILED
Return code1
Number of tests5
Successful tests4
Failed tests1
Percent successful80%
Test duration0:00:23.685533
Tested modulest.rast.aggregate

Supplementary files

Standard error output (stderr)

/usr/lib/python2.7/dist-packages/numpy/core/__init__.py:14: DeprecationWarning: CObject type is not supported in 3.x. Please use capsule objects instead.
  from . import multiarray
/usr/lib/python2.7/dist-packages/numpy/core/__init__.py:21: DeprecationWarning: CObject type is not supported in 3.x. Please use capsule objects instead.
  from . import umath
/usr/lib/python2.7/dist-packages/numpy/random/__init__.py:99: DeprecationWarning: CObject type is not supported in 3.x. Please use capsule objects instead.
  from .mtrand import *
etc/python/grass/pygrass/raster/history.py:14: DeprecationWarning: Overriding __eq__ blocks inheritance of __hash__ in 3.x
  class History(object):
/usr/lib/python2.7/dist-packages/mx/DateTime/mxDateTime/__init__.py:9: DeprecationWarning: CObject type is not supported in 3.x. Please use capsule objects instead.
  from mxDateTime import *
/usr/lib/python2.7/dist-packages/psycopg2/__init__.py:50: DeprecationWarning: CObject type is not supported in 3.x. Please use capsule objects instead.
  from psycopg2._psycopg import BINARY, NUMBER, STRING, DATETIME, ROWID
etc/python/grass/temporal/abstract_dataset.py:569: DeprecationWarning: Overriding __eq__ blocks inheritance of __hash__ in 3.x
  class AbstractDatasetComparisonKeyStartTime(object):
etc/python/grass/temporal/abstract_dataset.py:619: DeprecationWarning: Overriding __eq__ blocks inheritance of __hash__ in 3.x
  class AbstractDatasetComparisonKeyEndTime(object):
/usr/lib/python2.7/dist-packages/dateutil/relativedelta.py:10: DeprecationWarning: Overriding __eq__ blocks inheritance of __hash__ in 3.x
  class weekday(object):
/usr/lib/python2.7/dist-packages/dateutil/relativedelta.py:41: DeprecationWarning: Overriding __eq__ blocks inheritance of __hash__ in 3.x
  class relativedelta(object):
/usr/lib/python2.7/dist-packages/dateutil/tz.py:48: DeprecationWarning: Overriding __eq__ blocks inheritance of __hash__ in 3.x
  class tzutc(datetime.tzinfo):
/usr/lib/python2.7/dist-packages/dateutil/tz.py:73: DeprecationWarning: Overriding __eq__ blocks inheritance of __hash__ in 3.x
  class tzoffset(datetime.tzinfo):
/usr/lib/python2.7/dist-packages/dateutil/tz.py:104: DeprecationWarning: Overriding __eq__ blocks inheritance of __hash__ in 3.x
  class tzlocal(datetime.tzinfo):
/usr/lib/python2.7/dist-packages/dateutil/tz.py:175: DeprecationWarning: Overriding __eq__ blocks inheritance of __hash__ in 3.x
  class _ttinfo(object):
/usr/lib/python2.7/dist-packages/dateutil/tz.py:215: DeprecationWarning: Overriding __eq__ blocks inheritance of __hash__ in 3.x
  class tzfile(datetime.tzinfo):
/usr/lib/python2.7/dist-packages/dateutil/tz.py:507: DeprecationWarning: Overriding __eq__ blocks inheritance of __hash__ in 3.x
  class tzrange(datetime.tzinfo):
Default TGIS driver / database set to:
driver: sqlite
database: $GISDBASE/$LOCATION_NAME/$MAPSET/tgis/sqlite.db
WARNING: Temporal database connection defined as:
/grassdata/tests-grassdata/piemonte_utm32_wgs84_grass7/__temporal_t_rast_aggregate_test_aggregation_absolute/tgis/sqlite.db
But database file does not exist.
Creating temporal database: /grassdata/tests-grassdata/piemonte_utm32_wgs84_grass7/__temporal_t_rast_aggregate_test_aggregation_absolute/tgis/sqlite.db
/usr/lib/python2.7/xml/etree/ElementTree.py:1638: DeprecationWarning: This method of XMLParser is deprecated.  Define doctype() method on the TreeBuilder target.
  DeprecationWarning,
.F...
======================================================================
FAIL: test_aggregation_1month_time (__main__.TestAggregationAbsolute)
Aggregation one month time suffix
----------------------------------------------------------------------
Traceback (most recent call last):
  File "temporal/t.rast.aggregate/testsuite/test_aggregation_absolute.py", line 120, in test_aggregation_1month_time
    self.assertRasterExists('b_2001_01_01_00')
  File "etc/python/grass/gunittest/case.py", line 525, in assertRasterExists
    self.fail(self._formatMessage(msg, stdmsg))
AssertionError: There is no map <b_2001_01_01_00> of type <raster> in the current mapset
And there are no maps containing the name anywhere


----------------------------------------------------------------------
Ran 5 tests in 22.767s
FAILED (failures=1)