test_v_db_update

./scripts/v.db.update – test_v_db_update

Test failed

Testtest_v_db_update
Testsuite./scripts/v.db.update
Test file./scripts/v.db.update/testsuite/test_v_db_update.py
StatusFAILED
Return code1
Number of tests1
Successful tests0
Failed tests2
Percent successful0%
Test duration0:00:00.820430

Supplementary files

Standard error output (stderr)

WARNING: <geodetic_pts> not found
ERROR: Vector map <mygeodetic_pts> not found in current mapset
EERROR: Vector map <mygeodetic_pts> not found in current mapset
E
======================================================================
ERROR: test_update (__main__.TestVDbUpdate)
update value test
----------------------------------------------------------------------
Traceback (most recent call last):
  File "scripts/v.db.update/testsuite/test_v_db_update.py", line 33, in test_update
    column="zval double precision")
  File "etc/python/grass/script/core.py", line 452, in run_command
    return handle_errors(returncode, returncode, args, kwargs)
  File "etc/python/grass/script/core.py", line 354, in handle_errors
    returncode=returncode)
CalledModuleError: Module run None v.db.addcolumncolumn=zval double precisionmap=mygeodetic_pts ended with error
Process ended with non-zero return code 1. See errors in the (error) output.

======================================================================
ERROR: tearDownClass (__main__.TestVDbUpdate)
----------------------------------------------------------------------
Traceback (most recent call last):
  File "scripts/v.db.update/testsuite/test_v_db_update.py", line 27, in tearDownClass
    run_command('v.db.dropcolumn', map=cls.mapName, columns="zval")
  File "etc/python/grass/script/core.py", line 452, in run_command
    return handle_errors(returncode, returncode, args, kwargs)
  File "etc/python/grass/script/core.py", line 354, in handle_errors
    returncode=returncode)
CalledModuleError: Module run None v.db.dropcolumnmap=mygeodetic_ptscolumns=zval ended with error
Process ended with non-zero return code 1. See errors in the (error) output.

----------------------------------------------------------------------
Ran 1 test in 0.167s
FAILED (errors=2)