test_r_fillnulls

./scripts/r.fillnulls – test_r_fillnulls

Test failed

Testtest_r_fillnulls
Testsuite./scripts/r.fillnulls
Test file./scripts/r.fillnulls/testsuite/test_r_fillnulls.py
StatusFAILED
Return code1
Number of tests1
Successful tests0
Failed tests1
Percent successful0%
Test duration0:00:00.765546

Supplementary files

Standard error output (stderr)

/usr/lib/python2.7/xml/etree/ElementTree.py:1638: DeprecationWarning: This method of XMLParser is deprecated.  Define doctype() method on the TreeBuilder target.
  DeprecationWarning,
E
======================================================================
ERROR: setUpClass (__main__.TestRFillNulls)
----------------------------------------------------------------------
Traceback (most recent call last):
  File "scripts/r.fillnulls/testsuite/test_r_fillnulls.py", line 27, in setUpClass
    cls.runModule('g.region', raster=cls.mapName, flags='p')
  File "etc/python/grass/gunittest/case.py", line 1098, in runModule
    errors=errors)
CalledModuleError: Module run 1 g.region ended with error
Process ended with non-zero return code g.region(raster=['elev_srtm_30m'], flags=u'p'). See the following errors:
ERROR: Raster map <elev_srtm_30m> not found

See available raster maps:
basins
elevation
geology
lakes
landsat.blue
landsat.green
landsat.red
landuse
orthophoto.blue
orthophoto.green
orthophoto.red
orthophoto.rgb


----------------------------------------------------------------------
Ran 0 tests in 0.140s
FAILED (errors=1)