test_pygrass_modules_doctests

./lib/python/pygrass/modules – test_pygrass_modules_doctests

Test failed

Testtest_pygrass_modules_doctests
Testsuite./lib/python/pygrass/modules
Test file./lib/python/pygrass/modules/testsuite/test_pygrass_modules_doctests.py
StatusFAILED
Return code1
Number of tests7
Successful tests5
Failed tests2
Percent successful71%
Test duration0:00:43.830611

Supplementary files

Standard error output (stderr)

... (lines omitted)
Traceback (most recent call last):
  File "/usr/lib/python2.7/doctest.py", line 2226, in runTest
    raise self.failureException(self.format_failure(new.getvalue()))
AssertionError: Failed doctest test for grass.pygrass.modules.grid.grid.GridModule
  File "etc/python/grass/pygrass/modules/grid/grid.py", line 380, in GridModule

----------------------------------------------------------------------
File "etc/python/grass/pygrass/modules/grid/grid.py", line 407, in grass.pygrass.modules.grid.grid.GridModule
Failed example:
    grd.run()
Exception raised:
    Traceback (most recent call last):
      File "/usr/lib/python2.7/doctest.py", line 1315, in __run
        compileflags, 1) in test.globs
      File "<doctest grass.pygrass.modules.grid.grid.GridModule[1]>", line 1, in <module>
        grd.run()
      File "etc/python/grass/pygrass/modules/grid/grid.py", line 568, in run
        self.patch()
      File "etc/python/grass/pygrass/modules/grid/grid.py", line 609, in patch
        self.start_row, self.start_col, self.out_prefix)
      File "etc/python/grass/pygrass/modules/grid/patch.py", line 89, in rpatch_map
        rrasts[-1].open('r')
      File "etc/python/grass/pygrass/raster/__init__.py", line 210, in open
        raise OpenError(str_err)
    OpenError: The map does not exist, I can't open in 'r' mode


======================================================================
FAIL: copy_mapset (grass.pygrass.modules.grid.grid)
Doctest: grass.pygrass.modules.grid.grid.copy_mapset
----------------------------------------------------------------------
Traceback (most recent call last):
  File "/usr/lib/python2.7/doctest.py", line 2226, in runTest
    raise self.failureException(self.format_failure(new.getvalue()))
AssertionError: Failed doctest test for grass.pygrass.modules.grid.grid.copy_mapset
  File "etc/python/grass/pygrass/modules/grid/grid.py", line 63, in copy_mapset

----------------------------------------------------------------------
File "etc/python/grass/pygrass/modules/grid/grid.py", line 85, in grass.pygrass.modules.grid.grid.copy_mapset
Failed example:
    sorted(os.listdir(os.path.join(path, 'PERMANENT')))
Expected:
    [u'DEFAULT_WIND', u'PROJ_INFO', u'PROJ_UNITS', u'VAR', u'WIND']
Got:
    [u'CURGROUP', u'DEFAULT_WIND', u'MYNAME', u'PROJ_INFO', u'PROJ_UNITS', u'VAR', u'WIND']


----------------------------------------------------------------------
Ran 7 tests in 43.034s
FAILED (failures=2)