test_r_blend

./scripts/r.blend – test_r_blend

Test failed

Testtest_r_blend
Testsuite./scripts/r.blend
Test file./scripts/r.blend/testsuite/test_r_blend.py
StatusFAILED
Return code1
Number of tests1
Successful tests0
Failed tests1
Percent successful0%
Test duration0:00:00.832678

Supplementary files

Standard error output (stderr)

/usr/lib/python2.7/xml/etree/ElementTree.py:1638: DeprecationWarning: This method of XMLParser is deprecated.  Define doctype() method on the TreeBuilder target.
  DeprecationWarning,
E
======================================================================
ERROR: setUpClass (__main__.TestRBlend)
----------------------------------------------------------------------
Traceback (most recent call last):
  File "scripts/r.blend/testsuite/test_r_blend.py", line 26, in setUpClass
    cls.runModule('g.region', raster=cls.map1, flags='p')
  File "etc/python/grass/gunittest/case.py", line 1098, in runModule
    errors=errors)
CalledModuleError: Module run 1 g.region ended with error
Process ended with non-zero return code g.region(raster=['aspect'], flags=u'p'). See the following errors:
ERROR: Raster map <aspect> not found

See available raster maps:
basins
elevation
geology
lakes
landsat.blue
landsat.green
landsat.red
landuse
orthophoto.blue
orthophoto.green
orthophoto.red
orthophoto.rgb


----------------------------------------------------------------------
Ran 0 tests in 0.144s
FAILED (errors=1)