testrandom stderr

/usr/lib/python2.7/xml/etree/ElementTree.py:1638: DeprecationWarning: This method of XMLParser is deprecated.  Define doctype() method on the TreeBuilder target.
  DeprecationWarning,
F...
======================================================================
FAIL: test_flag_b (__main__.Testrr)
Testing flag b
----------------------------------------------------------------------
Traceback (most recent call last):
  File "raster/r.random/testsuite/testrandom.py", line 73, in test_flag_b
    self.assertVectorFitsTopoInfo(self.vector, topology)
  File "etc/python/grass/gunittest/case.py", line 361, in assertVectorFitsTopoInfo
    precision=0)
  File "etc/python/grass/gunittest/case.py", line 254, in assertModuleKeyValue
    self.fail(self._formatMessage(msg, stdMsg))
AssertionError: v.info map=voutfile layer=1 -t difference:
mismatch values (key, reference, actual): [('points', 36011, 35945)]
command: v.info map=voutfile layer=1 -t {'map': 'voutfile', 'flags': 't'}

----------------------------------------------------------------------
Ran 4 tests in 42.625s
FAILED (failures=1)