test_vect_extract

./temporal/t.vect.extract – test_vect_extract

Test failed

Testtest_vect_extract
Testsuite./temporal/t.vect.extract
Test file./temporal/t.vect.extract/testsuite/test_vect_extract.py
StatusFAILED
Return code1
Number of tests1
Successful tests0
Failed tests1
Percent successful0%
Test duration0:00:06.346808

Supplementary files

Standard error output (stderr)

/usr/lib/python2.7/xml/etree/ElementTree.py:1638: DeprecationWarning: This method of XMLParser is deprecated.  Define doctype() method on the TreeBuilder target.
  DeprecationWarning,
E
======================================================================
ERROR: setUpClass (__main__.TestVectorExtraction)
----------------------------------------------------------------------
Traceback (most recent call last):
  File "temporal/t.vect.extract/testsuite/test_vect_extract.py", line 33, in setUpClass
    cls.runModule("t.info", flags="d")
  File "etc/python/grass/gunittest/case.py", line 1098, in runModule
    errors=errors)
CalledModuleError: Module run 1 t.info ended with error
Process ended with non-zero return code t.info(, flags=u'd'). See the following errors:
Traceback (most recent call last):
  File "scripts/t.info", line 128, in <module>
    main()
  File "scripts/t.info", line 68, in main
    type_ = options["type"]
KeyError: 'type'


----------------------------------------------------------------------
Ran 0 tests in 5.635s
FAILED (errors=1)