test_shift

./temporal/t.shift – test_shift

Test failed

Testtest_shift
Testsuite./temporal/t.shift
Test file./temporal/t.shift/testsuite/test_shift.py
StatusFAILED
Return code1
Number of tests7
Successful tests0
Failed tests7
Percent successful0%
Test duration0:00:04.981503

Supplementary files

Standard error output (stderr)

... (lines omitted)
    module = _module_from_parameters(module, **kwargs)
  File "etc/python/grass/gunittest/case.py", line 1208, in _module_from_parameters
    module = SimpleModule(module, **kwargs)
  File "etc/python/grass/gunittest/gmodules.py", line 54, in __init__
    Module.__init__(self, cmd, *args, **kargs)
  File "etc/python/grass/pygrass/modules/interface/module.py", line 593, in __init__
    self.__call__(*args, **kargs)
  File "etc/python/grass/pygrass/modules/interface/module.py", line 640, in __call__
    raise ParameterError('%s is not a valid parameter.' % key)
ParameterError: temporaltype is not a valid parameter.

======================================================================
ERROR: setUpClass (__main__.TestShiftRelativeSTRDS)
----------------------------------------------------------------------
Traceback (most recent call last):
  File "temporal/t.shift/testsuite/test_shift.py", line 142, in setUpClass
    description="A test",  overwrite=True)
  File "etc/python/grass/gunittest/case.py", line 1077, in runModule
    module = _module_from_parameters(module, **kwargs)
  File "etc/python/grass/gunittest/case.py", line 1208, in _module_from_parameters
    module = SimpleModule(module, **kwargs)
  File "etc/python/grass/gunittest/gmodules.py", line 54, in __init__
    Module.__init__(self, cmd, *args, **kargs)
  File "etc/python/grass/pygrass/modules/interface/module.py", line 593, in __init__
    self.__call__(*args, **kargs)
  File "etc/python/grass/pygrass/modules/interface/module.py", line 640, in __call__
    raise ParameterError('%s is not a valid parameter.' % key)
ParameterError: temporaltype is not a valid parameter.

======================================================================
ERROR: setUpClass (__main__.TestShiftRelativeSTVDS)
----------------------------------------------------------------------
Traceback (most recent call last):
  File "temporal/t.shift/testsuite/test_shift.py", line 455, in setUpClass
    description="A test",  overwrite=True)
  File "etc/python/grass/gunittest/case.py", line 1077, in runModule
    module = _module_from_parameters(module, **kwargs)
  File "etc/python/grass/gunittest/case.py", line 1208, in _module_from_parameters
    module = SimpleModule(module, **kwargs)
  File "etc/python/grass/gunittest/gmodules.py", line 54, in __init__
    Module.__init__(self, cmd, *args, **kargs)
  File "etc/python/grass/pygrass/modules/interface/module.py", line 593, in __init__
    self.__call__(*args, **kargs)
  File "etc/python/grass/pygrass/modules/interface/module.py", line 640, in __call__
    raise ParameterError('%s is not a valid parameter.' % key)
ParameterError: temporaltype is not a valid parameter.

----------------------------------------------------------------------
Ran 0 tests in 4.108s
FAILED (errors=7)