test_what

./temporal/t.rast.what – test_what

Test failed

Testtest_what
Testsuite./temporal/t.rast.what
Test file./temporal/t.rast.what/testsuite/test_what.py
StatusFAILED
Return code1
Number of tests1
Successful tests1
Failed tests2
Percent successful100%
Test duration0:00:02.094296

Supplementary files

Standard error output (stderr)

/usr/lib/python2.7/xml/etree/ElementTree.py:1638: DeprecationWarning: This method of XMLParser is deprecated.  Define doctype() method on the TreeBuilder target.
  DeprecationWarning,
E.E
======================================================================
ERROR: setUpClass (__main__.TestRasterWhat)
----------------------------------------------------------------------
Traceback (most recent call last):
  File "temporal/t.rast.what/testsuite/test_what.py", line 34, in setUpClass
    overwrite=True)
  File "etc/python/grass/gunittest/case.py", line 1077, in runModule
    module = _module_from_parameters(module, **kwargs)
  File "etc/python/grass/gunittest/case.py", line 1208, in _module_from_parameters
    module = SimpleModule(module, **kwargs)
  File "etc/python/grass/gunittest/gmodules.py", line 54, in __init__
    Module.__init__(self, cmd, *args, **kargs)
  File "etc/python/grass/pygrass/modules/interface/module.py", line 593, in __init__
    self.__call__(*args, **kargs)
  File "etc/python/grass/pygrass/modules/interface/module.py", line 640, in __call__
    raise ParameterError('%s is not a valid parameter.' % key)
ParameterError: temporaltype is not a valid parameter.

======================================================================
ERROR: setUpClass (__main__.TestRasterWhatNull)
----------------------------------------------------------------------
Traceback (most recent call last):
  File "temporal/t.rast.what/testsuite/test_what.py", line 235, in setUpClass
    overwrite=True)
  File "etc/python/grass/gunittest/case.py", line 1077, in runModule
    module = _module_from_parameters(module, **kwargs)
  File "etc/python/grass/gunittest/case.py", line 1208, in _module_from_parameters
    module = SimpleModule(module, **kwargs)
  File "etc/python/grass/gunittest/gmodules.py", line 54, in __init__
    Module.__init__(self, cmd, *args, **kargs)
  File "etc/python/grass/pygrass/modules/interface/module.py", line 593, in __init__
    self.__call__(*args, **kargs)
  File "etc/python/grass/pygrass/modules/interface/module.py", line 640, in __call__
    raise ParameterError('%s is not a valid parameter.' % key)
ParameterError: temporaltype is not a valid parameter.

----------------------------------------------------------------------
Ran 1 test in 1.403s
FAILED (errors=2)