test_rast_export

./temporal/t.rast.export – test_rast_export

Test failed

Testtest_rast_export
Testsuite./temporal/t.rast.export
Test file./temporal/t.rast.export/testsuite/test_rast_export.py
StatusFAILED
Return code1
Number of tests1
Successful tests0
Failed tests1
Percent successful0%
Test duration0:00:01.384814

Supplementary files

Standard error output (stderr)

/usr/lib/python2.7/xml/etree/ElementTree.py:1638: DeprecationWarning: This method of XMLParser is deprecated.  Define doctype() method on the TreeBuilder target.
  DeprecationWarning,
E
======================================================================
ERROR: setUpClass (__main__.TestRasterExport)
----------------------------------------------------------------------
Traceback (most recent call last):
  File "temporal/t.rast.export/testsuite/test_rast_export.py", line 40, in setUpClass
    overwrite=True)
  File "etc/python/grass/gunittest/case.py", line 1077, in runModule
    module = _module_from_parameters(module, **kwargs)
  File "etc/python/grass/gunittest/case.py", line 1208, in _module_from_parameters
    module = SimpleModule(module, **kwargs)
  File "etc/python/grass/gunittest/gmodules.py", line 54, in __init__
    Module.__init__(self, cmd, *args, **kargs)
  File "etc/python/grass/pygrass/modules/interface/module.py", line 593, in __init__
    self.__call__(*args, **kargs)
  File "etc/python/grass/pygrass/modules/interface/module.py", line 640, in __call__
    raise ParameterError('%s is not a valid parameter.' % key)
ParameterError: temporaltype is not a valid parameter.

----------------------------------------------------------------------
Ran 0 tests in 0.746s
FAILED (errors=1)