test_convert

./temporal/t.rast.contour – test_convert

Test failed

Testtest_convert
Testsuite./temporal/t.rast.contour
Test file./temporal/t.rast.contour/testsuite/test_convert.py
StatusFAILED
Return code1
Number of tests2
Successful tests0
Failed tests2
Percent successful0%
Test duration0:00:01.355210

Supplementary files

Standard error output (stderr)

/usr/lib/python2.7/xml/etree/ElementTree.py:1638: DeprecationWarning: This method of XMLParser is deprecated.  Define doctype() method on the TreeBuilder target.
  DeprecationWarning,
EE
======================================================================
ERROR: setUpClass (__main__.TestRasterContour)
----------------------------------------------------------------------
Traceback (most recent call last):
  File "temporal/t.rast.contour/testsuite/test_convert.py", line 32, in setUpClass
    overwrite=True)
  File "etc/python/grass/gunittest/case.py", line 1077, in runModule
    module = _module_from_parameters(module, **kwargs)
  File "etc/python/grass/gunittest/case.py", line 1208, in _module_from_parameters
    module = SimpleModule(module, **kwargs)
  File "etc/python/grass/gunittest/gmodules.py", line 54, in __init__
    Module.__init__(self, cmd, *args, **kargs)
  File "etc/python/grass/pygrass/modules/interface/module.py", line 593, in __init__
    self.__call__(*args, **kargs)
  File "etc/python/grass/pygrass/modules/interface/module.py", line 640, in __call__
    raise ParameterError('%s is not a valid parameter.' % key)
ParameterError: temporaltype is not a valid parameter.

======================================================================
ERROR: setUpClass (__main__.TestRasterContourFails)
----------------------------------------------------------------------
Traceback (most recent call last):
  File "temporal/t.rast.contour/testsuite/test_convert.py", line 215, in setUpClass
    overwrite=True)
  File "etc/python/grass/gunittest/case.py", line 1077, in runModule
    module = _module_from_parameters(module, **kwargs)
  File "etc/python/grass/gunittest/case.py", line 1208, in _module_from_parameters
    module = SimpleModule(module, **kwargs)
  File "etc/python/grass/gunittest/gmodules.py", line 54, in __init__
    Module.__init__(self, cmd, *args, **kargs)
  File "etc/python/grass/pygrass/modules/interface/module.py", line 593, in __init__
    self.__call__(*args, **kargs)
  File "etc/python/grass/pygrass/modules/interface/module.py", line 640, in __call__
    raise ParameterError('%s is not a valid parameter.' % key)
ParameterError: temporaltype is not a valid parameter.

----------------------------------------------------------------------
Ran 0 tests in 0.678s
FAILED (errors=2)