test_raster_algebra_granularity_fails

./temporal/t.rast.algebra – test_raster_algebra_granularity_fails

Test failed

Testtest_raster_algebra_granularity_fails
Testsuite./temporal/t.rast.algebra
Test file./temporal/t.rast.algebra/testsuite/test_raster_algebra_granularity_fails.py
StatusFAILED
Return code1
Number of tests1
Successful tests1
Failed tests1
Percent successful100%
Test duration0:00:08.446764

Supplementary files

Standard error output (stderr)

/usr/lib/python2.7/dist-packages/numpy/core/__init__.py:14: DeprecationWarning: CObject type is not supported in 3.x. Please use capsule objects instead.
  from . import multiarray
/usr/lib/python2.7/dist-packages/numpy/core/__init__.py:21: DeprecationWarning: CObject type is not supported in 3.x. Please use capsule objects instead.
  from . import umath
/usr/lib/python2.7/dist-packages/numpy/random/__init__.py:99: DeprecationWarning: CObject type is not supported in 3.x. Please use capsule objects instead.
  from .mtrand import *
etc/python/grass/pygrass/raster/history.py:14: DeprecationWarning: Overriding __eq__ blocks inheritance of __hash__ in 3.x
  class History(object):
/usr/lib/python2.7/dist-packages/mx/DateTime/mxDateTime/__init__.py:9: DeprecationWarning: CObject type is not supported in 3.x. Please use capsule objects instead.
  from mxDateTime import *
/usr/lib/python2.7/dist-packages/psycopg2/__init__.py:50: DeprecationWarning: CObject type is not supported in 3.x. Please use capsule objects instead.
  from psycopg2._psycopg import BINARY, NUMBER, STRING, DATETIME, ROWID
etc/python/grass/temporal/abstract_dataset.py:569: DeprecationWarning: Overriding __eq__ blocks inheritance of __hash__ in 3.x
  class AbstractDatasetComparisonKeyStartTime(object):
etc/python/grass/temporal/abstract_dataset.py:619: DeprecationWarning: Overriding __eq__ blocks inheritance of __hash__ in 3.x
  class AbstractDatasetComparisonKeyEndTime(object):
/usr/lib/python2.7/dist-packages/dateutil/relativedelta.py:10: DeprecationWarning: Overriding __eq__ blocks inheritance of __hash__ in 3.x
  class weekday(object):
/usr/lib/python2.7/dist-packages/dateutil/relativedelta.py:41: DeprecationWarning: Overriding __eq__ blocks inheritance of __hash__ in 3.x
  class relativedelta(object):
/usr/lib/python2.7/dist-packages/dateutil/tz.py:48: DeprecationWarning: Overriding __eq__ blocks inheritance of __hash__ in 3.x
  class tzutc(datetime.tzinfo):
/usr/lib/python2.7/dist-packages/dateutil/tz.py:73: DeprecationWarning: Overriding __eq__ blocks inheritance of __hash__ in 3.x
  class tzoffset(datetime.tzinfo):
/usr/lib/python2.7/dist-packages/dateutil/tz.py:104: DeprecationWarning: Overriding __eq__ blocks inheritance of __hash__ in 3.x
  class tzlocal(datetime.tzinfo):
/usr/lib/python2.7/dist-packages/dateutil/tz.py:175: DeprecationWarning: Overriding __eq__ blocks inheritance of __hash__ in 3.x
  class _ttinfo(object):
/usr/lib/python2.7/dist-packages/dateutil/tz.py:215: DeprecationWarning: Overriding __eq__ blocks inheritance of __hash__ in 3.x
  class tzfile(datetime.tzinfo):
/usr/lib/python2.7/dist-packages/dateutil/tz.py:507: DeprecationWarning: Overriding __eq__ blocks inheritance of __hash__ in 3.x
  class tzrange(datetime.tzinfo):
Default TGIS driver / database set to:
driver: sqlite
database: $GISDBASE/$LOCATION_NAME/$MAPSET/tgis/sqlite.db
WARNING: Temporal database connection defined as:
/grassdata/tests-grassdata/piemonte_utm32_wgs84_grass7/__temporal_t_rast_algebra_test_raster_algebra_granularity_fails/tgis/sqlite.db
But database file does not exist.
Creating temporal database: /grassdata/tests-grassdata/piemonte_utm32_wgs84_grass7/__temporal_t_rast_algebra_test_raster_algebra_granularity_fails/tgis/sqlite.db
/usr/lib/python2.7/xml/etree/ElementTree.py:1638: DeprecationWarning: This method of XMLParser is deprecated.  Define doctype() method on the TreeBuilder target.
  DeprecationWarning,
Gathering map information...
0..100
Registering maps in the space time dataset...
0..Updating space time dataset...
100
Gathering map information...
0..100
Registering maps in the space time dataset...
0..Updating space time dataset...
100
.E
======================================================================
ERROR: tearDownClass (__main__.TestTRastAlgebraGranularityFails)
----------------------------------------------------------------------
Traceback (most recent call last):
  File "temporal/t.rast.algebra/testsuite/test_raster_algebra_granularity_fails.py", line 45, in tearDownClass
    cls.runModule("t.unregister", maps="singletmap", quiet=True)
  File "etc/python/grass/gunittest/case.py", line 1077, in runModule
    module = _module_from_parameters(module, **kwargs)
  File "etc/python/grass/gunittest/case.py", line 1208, in _module_from_parameters
    module = SimpleModule(module, **kwargs)
  File "etc/python/grass/gunittest/gmodules.py", line 54, in __init__
    Module.__init__(self, cmd, *args, **kargs)
  File "etc/python/grass/pygrass/modules/interface/module.py", line 593, in __init__
    self.__call__(*args, **kargs)
  File "etc/python/grass/pygrass/modules/interface/module.py", line 640, in __call__
    raise ParameterError('%s is not a valid parameter.' % key)
ParameterError: maps is not a valid parameter.

----------------------------------------------------------------------
Ran 1 test in 7.478s
FAILED (errors=1)