test_register_function stderr

/usr/lib/python2.7/dist-packages/numpy/core/__init__.py:14: DeprecationWarning: CObject type is not supported in 3.x. Please use capsule objects instead.
  from . import multiarray
/usr/lib/python2.7/dist-packages/numpy/core/__init__.py:21: DeprecationWarning: CObject type is not supported in 3.x. Please use capsule objects instead.
  from . import umath
/usr/lib/python2.7/dist-packages/numpy/random/__init__.py:99: DeprecationWarning: CObject type is not supported in 3.x. Please use capsule objects instead.
  from .mtrand import *
etc/python/grass/pygrass/raster/history.py:14: DeprecationWarning: Overriding __eq__ blocks inheritance of __hash__ in 3.x
  class History(object):
/usr/lib/python2.7/dist-packages/mx/DateTime/mxDateTime/__init__.py:9: DeprecationWarning: CObject type is not supported in 3.x. Please use capsule objects instead.
  from mxDateTime import *
/usr/lib/python2.7/dist-packages/psycopg2/__init__.py:50: DeprecationWarning: CObject type is not supported in 3.x. Please use capsule objects instead.
  from psycopg2._psycopg import BINARY, NUMBER, STRING, DATETIME, ROWID
etc/python/grass/temporal/abstract_dataset.py:569: DeprecationWarning: Overriding __eq__ blocks inheritance of __hash__ in 3.x
  class AbstractDatasetComparisonKeyStartTime(object):
etc/python/grass/temporal/abstract_dataset.py:619: DeprecationWarning: Overriding __eq__ blocks inheritance of __hash__ in 3.x
  class AbstractDatasetComparisonKeyEndTime(object):
/usr/lib/python2.7/dist-packages/dateutil/relativedelta.py:10: DeprecationWarning: Overriding __eq__ blocks inheritance of __hash__ in 3.x
  class weekday(object):
/usr/lib/python2.7/dist-packages/dateutil/relativedelta.py:41: DeprecationWarning: Overriding __eq__ blocks inheritance of __hash__ in 3.x
  class relativedelta(object):
/usr/lib/python2.7/dist-packages/dateutil/tz.py:48: DeprecationWarning: Overriding __eq__ blocks inheritance of __hash__ in 3.x
  class tzutc(datetime.tzinfo):
/usr/lib/python2.7/dist-packages/dateutil/tz.py:73: DeprecationWarning: Overriding __eq__ blocks inheritance of __hash__ in 3.x
  class tzoffset(datetime.tzinfo):
/usr/lib/python2.7/dist-packages/dateutil/tz.py:104: DeprecationWarning: Overriding __eq__ blocks inheritance of __hash__ in 3.x
  class tzlocal(datetime.tzinfo):
/usr/lib/python2.7/dist-packages/dateutil/tz.py:175: DeprecationWarning: Overriding __eq__ blocks inheritance of __hash__ in 3.x
  class _ttinfo(object):
/usr/lib/python2.7/dist-packages/dateutil/tz.py:215: DeprecationWarning: Overriding __eq__ blocks inheritance of __hash__ in 3.x
  class tzfile(datetime.tzinfo):
/usr/lib/python2.7/dist-packages/dateutil/tz.py:507: DeprecationWarning: Overriding __eq__ blocks inheritance of __hash__ in 3.x
  class tzrange(datetime.tzinfo):
/usr/lib/python2.7/xml/etree/ElementTree.py:1638: DeprecationWarning: This method of XMLParser is deprecated.  Define doctype() method on the TreeBuilder target.
  DeprecationWarning,
Default TGIS driver / database set to:
driver: sqlite
database: $GISDBASE/$LOCATION_NAME/$MAPSET/tgis/sqlite.db
WARNING: Temporal database connection defined as:
/grassdata/tests-grassdata/piemonte_utm32_wgs84_grass7/__lib_python_temporal_test_register_function/tgis/sqlite.db
But database file does not exist.
Creating temporal database: /grassdata/tests-grassdata/piemonte_utm32_wgs84_grass7/__lib_python_temporal_test_register_function/tgis/sqlite.db
Gathering map information...
0..100
Registering maps in the temporal database...
100
Gathering map information...
0..WARNING: Map is already registered in temporal database. Unable to update raster map <register_map_1@__lib_python_temporal_test_register_function>. Overwrite flag is not set.
WARNING: Map is already registered in temporal database. Unable to update raster map <register_map_2@__lib_python_temporal_test_register_function>. Overwrite flag is not set.
100
Registering maps in the space time dataset...
0..Updating space time dataset...
100
EWARNING: Overwriting space time raster dataset <register_test_abs> and unregistering all maps
WARNING: Overwriting space time raster dataset <register_test_rel> and unregistering all maps
Gathering map information...
0..WARNING: Map is already registered in temporal database. Unable to update raster map <register_map_1@__lib_python_temporal_test_register_function>. Overwrite flag is not set.
WARNING: Map is already registered in temporal database. Unable to update raster map <register_map_2@__lib_python_temporal_test_register_function>. Overwrite flag is not set.
100
Registering maps in the temporal database...
100
FEWARNING: Overwriting space time raster dataset <register_test_abs> and unregistering all maps
WARNING: Overwriting space time raster dataset <register_test_rel> and unregistering all maps
Gathering map information...
0..WARNING: Map is already registered in temporal database. Unable to update raster map <register_map_1@__lib_python_temporal_test_register_function>. Overwrite flag is not set.
WARNING: Map is already registered in temporal database. Unable to update raster map <register_map_2@__lib_python_temporal_test_register_function>. Overwrite flag is not set.
100
100
FEWARNING: Overwriting space time raster dataset <register_test_abs> and unregistering all maps
WARNING: Overwriting space time raster dataset <register_test_rel> and unregistering all maps
Gathering map information...
0..WARNING: Map is already registered in temporal database. Unable to update raster map <register_map_1@__lib_python_temporal_test_register_function>. Overwrite flag is not set.
WARNING: Map is already registered in temporal database. Unable to update raster map <register_map_2@__lib_python_temporal_test_register_function>. Overwrite flag is not set.
100
Registering maps in the space time dataset...
0..Updating space time dataset...
100
EWARNING: Overwriting space time raster dataset <register_test_abs> and unregistering all maps
WARNING: Overwriting space time raster dataset <register_test_rel> and unregistering all maps
Gathering map information...
0..WARNING: Map is already registered in temporal database. Unable to update raster map <register_map_1@__lib_python_temporal_test_register_function>. Overwrite flag is not set.
WARNING: Map is already registered in temporal database. Unable to update raster map <register_map_2@__lib_python_temporal_test_register_function>. Overwrite flag is not set.
100
Registering maps in the space time dataset...
0..Updating space time dataset...
100
EWARNING: Overwriting space time raster dataset <register_test_abs> and unregistering all maps
WARNING: Overwriting space time raster dataset <register_test_rel> and unregistering all maps
Gathering map information...
0..WARNING: Map is already registered in temporal database. Unable to update raster map <register_map_1@__lib_python_temporal_test_register_function>. Overwrite flag is not set.
100
Registering maps in the space time dataset...
0..Updating space time dataset...
100
FEWARNING: Overwriting space time raster dataset <register_test_abs> and unregistering all maps
WARNING: Overwriting space time raster dataset <register_test_rel> and unregistering all maps
Gathering map information...
0..WARNING: Map is already registered in temporal database. Unable to update raster map <register_map_1@__lib_python_temporal_test_register_function>. Overwrite flag is not set.
100
Registering maps in the space time dataset...
0..Updating space time dataset...
100
FEWARNING: Overwriting space time raster dataset <register_test_abs> and unregistering all maps
WARNING: Overwriting space time raster dataset <register_test_rel> and unregistering all maps
Gathering map information...
0..WARNING: Map is already registered in temporal database. Unable to update raster map <register_map_1@__lib_python_temporal_test_register_function>. Overwrite flag is not set.
WARNING: Map is already registered in temporal database. Unable to update raster map <register_map_2@__lib_python_temporal_test_register_function>. Overwrite flag is not set.
100
100
FEWARNING: Overwriting space time raster dataset <register_test_abs> and unregistering all maps
WARNING: Overwriting space time raster dataset <register_test_rel> and unregistering all maps
Gathering map information...
0..WARNING: Map is already registered in temporal database. Unable to update raster map <register_map_1@__lib_python_temporal_test_register_function>. Overwrite flag is not set.
WARNING: Map is already registered in temporal database. Unable to update raster map <register_map_2@__lib_python_temporal_test_register_function>. Overwrite flag is not set.
100
100
FEWARNING: Overwriting space time raster dataset <register_test_abs> and unregistering all maps
WARNING: Overwriting space time raster dataset <register_test_rel> and unregistering all maps
Gathering map information...
0..WARNING: Map is already registered in temporal database. Unable to update raster map <register_map_1@__lib_python_temporal_test_register_function>. Overwrite flag is not set.
WARNING: Map is already registered in temporal database. Unable to update raster map <register_map_2@__lib_python_temporal_test_register_function>. Overwrite flag is not set.
100
100
FEWARNING: Overwriting space time raster dataset <register_test_abs> and unregistering all maps
WARNING: Overwriting space time raster dataset <register_test_rel> and unregistering all maps
Gathering map information...
0..WARNING: Map is already registered in temporal database. Unable to update raster map <register_map_1@__lib_python_temporal_test_register_function>. Overwrite flag is not set.
WARNING: Map is already registered in temporal database. Unable to update raster map <register_map_2@__lib_python_temporal_test_register_function>. Overwrite flag is not set.
100
Registering maps in the space time dataset...
0..ERROR: Temporal type of space time dataset <register_test_rel@__lib_python_temporal_test_register_function> and map <register_map_1@__lib_python_temporal_test_register_function> are different
EEWARNING: Needed to restart the messenger server
WARNING: Overwriting space time raster dataset <register_test_abs> and unregistering all maps
WARNING: Overwriting space time raster dataset <register_test_rel> and unregistering all maps
Gathering map information...
0..WARNING: Map is already registered in temporal database. Unable to update raster map <register_map_1@__lib_python_temporal_test_register_function>. Overwrite flag is not set.
WARNING: Map is already registered in temporal database. Unable to update raster map <register_map_2@__lib_python_temporal_test_register_function>. Overwrite flag is not set.
100
Registering maps in the space time dataset...
0..ERROR: Temporal type of space time dataset <register_test_rel@__lib_python_temporal_test_register_function> and map <register_map_1@__lib_python_temporal_test_register_function> are different
EEE.EEEEEWARNING: Needed to restart the messenger server
Gathering map information...
0..100
Registering maps in the temporal database...
100
Gathering map information...
0..WARNING: Map is already registered in temporal database. Unable to update vector map <register_map_1@__lib_python_temporal_test_register_function>. Overwrite flag is not set.
WARNING: Map is already registered in temporal database. Unable to update vector map <register_map_2@__lib_python_temporal_test_register_function>. Overwrite flag is not set.
100
Registering maps in the space time dataset...
0..Updating space time dataset...
100
EWARNING: Overwriting space time vector dataset <register_test_abs> and unregistering all maps
WARNING: Overwriting space time vector dataset <register_test_rel> and unregistering all maps
Gathering map information...
0..WARNING: Map is already registered in temporal database. Unable to update vector map <register_map_1@__lib_python_temporal_test_register_function>. Overwrite flag is not set.
WARNING: Map is already registered in temporal database. Unable to update vector map <register_map_2@__lib_python_temporal_test_register_function>. Overwrite flag is not set.
100
Registering maps in the temporal database...
100
Gathering map information...
0..WARNING: Map is already registered in temporal database. Unable to update vector map <register_map_1@__lib_python_temporal_test_register_function>. Overwrite flag is not set.
WARNING: Map is already registered in temporal database. Unable to update vector map <register_map_2@__lib_python_temporal_test_register_function>. Overwrite flag is not set.
100
Registering maps in the space time dataset...
0..Updating space time dataset...
100
EWARNING: Overwriting space time vector dataset <register_test_abs> and unregistering all maps
WARNING: Overwriting space time vector dataset <register_test_rel> and unregistering all maps
Gathering map information...
0..WARNING: Map is already registered in temporal database. Unable to update vector map <register_map_1@__lib_python_temporal_test_register_function>. Overwrite flag is not set.
WARNING: Map is already registered in temporal database. Unable to update vector map <register_map_2@__lib_python_temporal_test_register_function>. Overwrite flag is not set.
100
Registering maps in the space time dataset...
0..Updating space time dataset...
100
EWARNING: Overwriting space time vector dataset <register_test_abs> and unregistering all maps
WARNING: Overwriting space time vector dataset <register_test_rel> and unregistering all maps
Gathering map information...
0..WARNING: Map is already registered in temporal database. Unable to update vector map <register_map_1@__lib_python_temporal_test_register_function>. Overwrite flag is not set.
WARNING: Map is already registered in temporal database. Unable to update vector map <register_map_2@__lib_python_temporal_test_register_function>. Overwrite flag is not set.
100
Registering maps in the space time dataset...
0..Updating space time dataset...
100
EWARNING: Overwriting space time vector dataset <register_test_abs> and unregistering all maps
WARNING: Overwriting space time vector dataset <register_test_rel> and unregistering all maps
Gathering map information...
0..WARNING: Map is already registered in temporal database. Unable to update vector map <register_map_1@__lib_python_temporal_test_register_function>. Overwrite flag is not set.
100
Registering maps in the space time dataset...
0..Updating space time dataset...
100
FE
======================================================================
ERROR: test_absolute_time_1 (__main__.TestRasterRegisterFunctions)
Test the registration of maps with absolute time
----------------------------------------------------------------------
Traceback (most recent call last):
  File "lib/python/temporal/testsuite/test_register_function.py", line 59, in tearDown
    quiet=True)
  File "etc/python/grass/gunittest/case.py", line 1077, in runModule
    module = _module_from_parameters(module, **kwargs)
  File "etc/python/grass/gunittest/case.py", line 1208, in _module_from_parameters
    module = SimpleModule(module, **kwargs)
  File "etc/python/grass/gunittest/gmodules.py", line 54, in __init__
    Module.__init__(self, cmd, *args, **kargs)
  File "etc/python/grass/pygrass/modules/interface/module.py", line 593, in __init__
    self.__call__(*args, **kargs)
  File "etc/python/grass/pygrass/modules/interface/module.py", line 640, in __call__
    raise ParameterError('%s is not a valid parameter.' % key)
ParameterError: maps is not a valid parameter.

======================================================================
ERROR: test_absolute_time_2 (__main__.TestRasterRegisterFunctions)
Test the registration of maps with absolute time
----------------------------------------------------------------------
Traceback (most recent call last):
  File "lib/python/temporal/testsuite/test_register_function.py", line 59, in tearDown
    quiet=True)
  File "etc/python/grass/gunittest/case.py", line 1077, in runModule
    module = _module_from_parameters(module, **kwargs)
  File "etc/python/grass/gunittest/case.py", line 1208, in _module_from_parameters
    module = SimpleModule(module, **kwargs)
  File "etc/python/grass/gunittest/gmodules.py", line 54, in __init__
    Module.__init__(self, cmd, *args, **kargs)
  File "etc/python/grass/pygrass/modules/interface/module.py", line 593, in __init__
    self.__call__(*args, **kargs)
  File "etc/python/grass/pygrass/modules/interface/module.py", line 640, in __call__
    raise ParameterError('%s is not a valid parameter.' % key)
ParameterError: maps is not a valid parameter.

======================================================================
ERROR: test_absolute_time_3 (__main__.TestRasterRegisterFunctions)
Test the registration of maps with absolute time.
----------------------------------------------------------------------
Traceback (most recent call last):
  File "lib/python/temporal/testsuite/test_register_function.py", line 59, in tearDown
    quiet=True)
  File "etc/python/grass/gunittest/case.py", line 1077, in runModule
    module = _module_from_parameters(module, **kwargs)
  File "etc/python/grass/gunittest/case.py", line 1208, in _module_from_parameters
    module = SimpleModule(module, **kwargs)
  File "etc/python/grass/gunittest/gmodules.py", line 54, in __init__
    Module.__init__(self, cmd, *args, **kargs)
  File "etc/python/grass/pygrass/modules/interface/module.py", line 593, in __init__
    self.__call__(*args, **kargs)
  File "etc/python/grass/pygrass/modules/interface/module.py", line 640, in __call__
    raise ParameterError('%s is not a valid parameter.' % key)
ParameterError: maps is not a valid parameter.

======================================================================
ERROR: test_absolute_time_strds_1 (__main__.TestRasterRegisterFunctions)
Test the registration of maps with absolute time in a
----------------------------------------------------------------------
Traceback (most recent call last):
  File "lib/python/temporal/testsuite/test_register_function.py", line 59, in tearDown
    quiet=True)
  File "etc/python/grass/gunittest/case.py", line 1077, in runModule
    module = _module_from_parameters(module, **kwargs)
  File "etc/python/grass/gunittest/case.py", line 1208, in _module_from_parameters
    module = SimpleModule(module, **kwargs)
  File "etc/python/grass/gunittest/gmodules.py", line 54, in __init__
    Module.__init__(self, cmd, *args, **kargs)
  File "etc/python/grass/pygrass/modules/interface/module.py", line 593, in __init__
    self.__call__(*args, **kargs)
  File "etc/python/grass/pygrass/modules/interface/module.py", line 640, in __call__
    raise ParameterError('%s is not a valid parameter.' % key)
ParameterError: maps is not a valid parameter.

======================================================================
ERROR: test_absolute_time_strds_2 (__main__.TestRasterRegisterFunctions)
Test the registration of maps with absolute time in a
----------------------------------------------------------------------
Traceback (most recent call last):
  File "lib/python/temporal/testsuite/test_register_function.py", line 59, in tearDown
    quiet=True)
  File "etc/python/grass/gunittest/case.py", line 1077, in runModule
    module = _module_from_parameters(module, **kwargs)
  File "etc/python/grass/gunittest/case.py", line 1208, in _module_from_parameters
    module = SimpleModule(module, **kwargs)
  File "etc/python/grass/gunittest/gmodules.py", line 54, in __init__
    Module.__init__(self, cmd, *args, **kargs)
  File "etc/python/grass/pygrass/modules/interface/module.py", line 593, in __init__
    self.__call__(*args, **kargs)
  File "etc/python/grass/pygrass/modules/interface/module.py", line 640, in __call__
    raise ParameterError('%s is not a valid parameter.' % key)
ParameterError: maps is not a valid parameter.

======================================================================
ERROR: test_absolute_time_strds_3 (__main__.TestRasterRegisterFunctions)
Test the registration of maps with absolute time in a
----------------------------------------------------------------------
Traceback (most recent call last):
  File "lib/python/temporal/testsuite/test_register_function.py", line 59, in tearDown
    quiet=True)
  File "etc/python/grass/gunittest/case.py", line 1077, in runModule
    module = _module_from_parameters(module, **kwargs)
  File "etc/python/grass/gunittest/case.py", line 1208, in _module_from_parameters
    module = SimpleModule(module, **kwargs)
  File "etc/python/grass/gunittest/gmodules.py", line 54, in __init__
    Module.__init__(self, cmd, *args, **kargs)
  File "etc/python/grass/pygrass/modules/interface/module.py", line 593, in __init__
    self.__call__(*args, **kargs)
  File "etc/python/grass/pygrass/modules/interface/module.py", line 640, in __call__
    raise ParameterError('%s is not a valid parameter.' % key)
ParameterError: maps is not a valid parameter.

======================================================================
ERROR: test_absolute_time_strds_4 (__main__.TestRasterRegisterFunctions)
Test the registration of maps with absolute time in a
----------------------------------------------------------------------
Traceback (most recent call last):
  File "lib/python/temporal/testsuite/test_register_function.py", line 59, in tearDown
    quiet=True)
  File "etc/python/grass/gunittest/case.py", line 1077, in runModule
    module = _module_from_parameters(module, **kwargs)
  File "etc/python/grass/gunittest/case.py", line 1208, in _module_from_parameters
    module = SimpleModule(module, **kwargs)
  File "etc/python/grass/gunittest/gmodules.py", line 54, in __init__
    Module.__init__(self, cmd, *args, **kargs)
  File "etc/python/grass/pygrass/modules/interface/module.py", line 593, in __init__
    self.__call__(*args, **kargs)
  File "etc/python/grass/pygrass/modules/interface/module.py", line 640, in __call__
    raise ParameterError('%s is not a valid parameter.' % key)
ParameterError: maps is not a valid parameter.

======================================================================
ERROR: test_relative_time_1 (__main__.TestRasterRegisterFunctions)
Test the registration of maps with relative time
----------------------------------------------------------------------
Traceback (most recent call last):
  File "lib/python/temporal/testsuite/test_register_function.py", line 59, in tearDown
    quiet=True)
  File "etc/python/grass/gunittest/case.py", line 1077, in runModule
    module = _module_from_parameters(module, **kwargs)
  File "etc/python/grass/gunittest/case.py", line 1208, in _module_from_parameters
    module = SimpleModule(module, **kwargs)
  File "etc/python/grass/gunittest/gmodules.py", line 54, in __init__
    Module.__init__(self, cmd, *args, **kargs)
  File "etc/python/grass/pygrass/modules/interface/module.py", line 593, in __init__
    self.__call__(*args, **kargs)
  File "etc/python/grass/pygrass/modules/interface/module.py", line 640, in __call__
    raise ParameterError('%s is not a valid parameter.' % key)
ParameterError: maps is not a valid parameter.

======================================================================
ERROR: test_relative_time_2 (__main__.TestRasterRegisterFunctions)
Test the registration of maps with relative time
----------------------------------------------------------------------
Traceback (most recent call last):
  File "lib/python/temporal/testsuite/test_register_function.py", line 59, in tearDown
    quiet=True)
  File "etc/python/grass/gunittest/case.py", line 1077, in runModule
    module = _module_from_parameters(module, **kwargs)
  File "etc/python/grass/gunittest/case.py", line 1208, in _module_from_parameters
    module = SimpleModule(module, **kwargs)
  File "etc/python/grass/gunittest/gmodules.py", line 54, in __init__
    Module.__init__(self, cmd, *args, **kargs)
  File "etc/python/grass/pygrass/modules/interface/module.py", line 593, in __init__
    self.__call__(*args, **kargs)
  File "etc/python/grass/pygrass/modules/interface/module.py", line 640, in __call__
    raise ParameterError('%s is not a valid parameter.' % key)
ParameterError: maps is not a valid parameter.

======================================================================
ERROR: test_relative_time_3 (__main__.TestRasterRegisterFunctions)
Test the registration of maps with relative time. The timetsamps are set beforehand using
----------------------------------------------------------------------
Traceback (most recent call last):
  File "lib/python/temporal/testsuite/test_register_function.py", line 59, in tearDown
    quiet=True)
  File "etc/python/grass/gunittest/case.py", line 1077, in runModule
    module = _module_from_parameters(module, **kwargs)
  File "etc/python/grass/gunittest/case.py", line 1208, in _module_from_parameters
    module = SimpleModule(module, **kwargs)
  File "etc/python/grass/gunittest/gmodules.py", line 54, in __init__
    Module.__init__(self, cmd, *args, **kargs)
  File "etc/python/grass/pygrass/modules/interface/module.py", line 593, in __init__
    self.__call__(*args, **kargs)
  File "etc/python/grass/pygrass/modules/interface/module.py", line 640, in __call__
    raise ParameterError('%s is not a valid parameter.' % key)
ParameterError: maps is not a valid parameter.

======================================================================
ERROR: test_relative_time_strds_1 (__main__.TestRasterRegisterFunctions)
Test the registration of maps with relative time in a
----------------------------------------------------------------------
Traceback (most recent call last):
  File "lib/python/temporal/testsuite/test_register_function.py", line 270, in test_relative_time_strds_1
    increment=1, unit="day", interval=True)
  File "etc/python/grass/temporal/register.py", line 341, in register_maps_in_space_time_dataset
    sp.register_map(map=map, dbif=dbif)
  File "etc/python/grass/temporal/abstract_space_time_dataset.py", line 2120, in register_map
    'map': map.get_map_id()})
  File "etc/python/grass/pygrass/messages/__init__.py", line 271, in fatal
    sys.exit(1)
SystemExit: 1

======================================================================
ERROR: test_relative_time_strds_1 (__main__.TestRasterRegisterFunctions)
Test the registration of maps with relative time in a
----------------------------------------------------------------------
Traceback (most recent call last):
  File "lib/python/temporal/testsuite/test_register_function.py", line 59, in tearDown
    quiet=True)
  File "etc/python/grass/gunittest/case.py", line 1077, in runModule
    module = _module_from_parameters(module, **kwargs)
  File "etc/python/grass/gunittest/case.py", line 1208, in _module_from_parameters
    module = SimpleModule(module, **kwargs)
  File "etc/python/grass/gunittest/gmodules.py", line 54, in __init__
    Module.__init__(self, cmd, *args, **kargs)
  File "etc/python/grass/pygrass/modules/interface/module.py", line 593, in __init__
    self.__call__(*args, **kargs)
  File "etc/python/grass/pygrass/modules/interface/module.py", line 640, in __call__
    raise ParameterError('%s is not a valid parameter.' % key)
ParameterError: maps is not a valid parameter.

======================================================================
ERROR: test_relative_time_strds_2 (__main__.TestRasterRegisterFunctions)
Test the registration of maps with relative time in a
----------------------------------------------------------------------
Traceback (most recent call last):
  File "lib/python/temporal/testsuite/test_register_function.py", line 302, in test_relative_time_strds_2
    maps="register_map_1,register_map_2")
  File "etc/python/grass/temporal/register.py", line 341, in register_maps_in_space_time_dataset
    sp.register_map(map=map, dbif=dbif)
  File "etc/python/grass/temporal/abstract_space_time_dataset.py", line 2120, in register_map
    'map': map.get_map_id()})
  File "etc/python/grass/pygrass/messages/__init__.py", line 271, in fatal
    sys.exit(1)
SystemExit: 1

======================================================================
ERROR: test_relative_time_strds_2 (__main__.TestRasterRegisterFunctions)
Test the registration of maps with relative time in a
----------------------------------------------------------------------
Traceback (most recent call last):
  File "lib/python/temporal/testsuite/test_register_function.py", line 59, in tearDown
    quiet=True)
  File "etc/python/grass/gunittest/case.py", line 1077, in runModule
    module = _module_from_parameters(module, **kwargs)
  File "etc/python/grass/gunittest/case.py", line 1208, in _module_from_parameters
    module = SimpleModule(module, **kwargs)
  File "etc/python/grass/gunittest/gmodules.py", line 54, in __init__
    Module.__init__(self, cmd, *args, **kargs)
  File "etc/python/grass/pygrass/modules/interface/module.py", line 593, in __init__
    self.__call__(*args, **kargs)
  File "etc/python/grass/pygrass/modules/interface/module.py", line 640, in __call__
    raise ParameterError('%s is not a valid parameter.' % key)
ParameterError: maps is not a valid parameter.

======================================================================
ERROR: test_error_handling_1 (__main__.TestRegisterFails)
----------------------------------------------------------------------
Traceback (most recent call last):
  File "lib/python/temporal/testsuite/test_register_function.py", line 599, in test_error_handling_1
    self.assertModuleFail("t.register", input="test", end='2001-01-01', maps=("a", "b"))
  File "etc/python/grass/gunittest/case.py", line 1179, in assertModuleFail
    module = _module_from_parameters(module, **kwargs)
  File "etc/python/grass/gunittest/case.py", line 1208, in _module_from_parameters
    module = SimpleModule(module, **kwargs)
  File "etc/python/grass/gunittest/gmodules.py", line 54, in __init__
    Module.__init__(self, cmd, *args, **kargs)
  File "etc/python/grass/pygrass/modules/interface/module.py", line 593, in __init__
    self.__call__(*args, **kargs)
  File "etc/python/grass/pygrass/modules/interface/module.py", line 640, in __call__
    raise ParameterError('%s is not a valid parameter.' % key)
ParameterError: maps is not a valid parameter.

======================================================================
ERROR: test_error_handling_3 (__main__.TestRegisterFails)
----------------------------------------------------------------------
Traceback (most recent call last):
  File "lib/python/temporal/testsuite/test_register_function.py", line 607, in test_error_handling_3
    self.assertModuleFail("t.register", input="test", start='2001-01-01', maps=("a", "b"), file="maps.txt")
  File "etc/python/grass/gunittest/case.py", line 1179, in assertModuleFail
    module = _module_from_parameters(module, **kwargs)
  File "etc/python/grass/gunittest/case.py", line 1208, in _module_from_parameters
    module = SimpleModule(module, **kwargs)
  File "etc/python/grass/gunittest/gmodules.py", line 54, in __init__
    Module.__init__(self, cmd, *args, **kargs)
  File "etc/python/grass/pygrass/modules/interface/module.py", line 593, in __init__
    self.__call__(*args, **kargs)
  File "etc/python/grass/pygrass/modules/interface/module.py", line 640, in __call__
    raise ParameterError('%s is not a valid parameter.' % key)
ParameterError: maps is not a valid parameter.

======================================================================
ERROR: test_error_handling_4 (__main__.TestRegisterFails)
----------------------------------------------------------------------
Traceback (most recent call last):
  File "lib/python/temporal/testsuite/test_register_function.py", line 611, in test_error_handling_4
    self.assertModuleFail("t.register", input="test", increment="1 day", maps=("a", "b"))
  File "etc/python/grass/gunittest/case.py", line 1179, in assertModuleFail
    module = _module_from_parameters(module, **kwargs)
  File "etc/python/grass/gunittest/case.py", line 1208, in _module_from_parameters
    module = SimpleModule(module, **kwargs)
  File "etc/python/grass/gunittest/gmodules.py", line 54, in __init__
    Module.__init__(self, cmd, *args, **kargs)
  File "etc/python/grass/pygrass/modules/interface/module.py", line 593, in __init__
    self.__call__(*args, **kargs)
  File "etc/python/grass/pygrass/modules/interface/module.py", line 640, in __call__
    raise ParameterError('%s is not a valid parameter.' % key)
ParameterError: maps is not a valid parameter.

======================================================================
ERROR: test_error_handling_5 (__main__.TestRegisterFails)
----------------------------------------------------------------------
Traceback (most recent call last):
  File "lib/python/temporal/testsuite/test_register_function.py", line 615, in test_error_handling_5
    self.assertModuleFail("t.register", flags="i", input="test", maps=("a", "b"))
  File "etc/python/grass/gunittest/case.py", line 1179, in assertModuleFail
    module = _module_from_parameters(module, **kwargs)
  File "etc/python/grass/gunittest/case.py", line 1208, in _module_from_parameters
    module = SimpleModule(module, **kwargs)
  File "etc/python/grass/gunittest/gmodules.py", line 54, in __init__
    Module.__init__(self, cmd, *args, **kargs)
  File "etc/python/grass/pygrass/modules/interface/module.py", line 593, in __init__
    self.__call__(*args, **kargs)
  File "etc/python/grass/pygrass/modules/interface/module.py", line 640, in __call__
    raise ParameterError('%s is not a valid parameter.' % key)
ParameterError: maps is not a valid parameter.

======================================================================
ERROR: test_error_handling_6 (__main__.TestRegisterFails)
----------------------------------------------------------------------
Traceback (most recent call last):
  File "lib/python/temporal/testsuite/test_register_function.py", line 620, in test_error_handling_6
    increment="1 day", maps=("a", "b"))
  File "etc/python/grass/gunittest/case.py", line 1179, in assertModuleFail
    module = _module_from_parameters(module, **kwargs)
  File "etc/python/grass/gunittest/case.py", line 1208, in _module_from_parameters
    module = SimpleModule(module, **kwargs)
  File "etc/python/grass/gunittest/gmodules.py", line 54, in __init__
    Module.__init__(self, cmd, *args, **kargs)
  File "etc/python/grass/pygrass/modules/interface/module.py", line 593, in __init__
    self.__call__(*args, **kargs)
  File "etc/python/grass/pygrass/modules/interface/module.py", line 640, in __call__
    raise ParameterError('%s is not a valid parameter.' % key)
ParameterError: maps is not a valid parameter.

======================================================================
ERROR: test_error_handling_7 (__main__.TestRegisterFails)
----------------------------------------------------------------------
Traceback (most recent call last):
  File "lib/python/temporal/testsuite/test_register_function.py", line 625, in test_error_handling_7
    maps=("a", "b"))
  File "etc/python/grass/gunittest/case.py", line 1179, in assertModuleFail
    module = _module_from_parameters(module, **kwargs)
  File "etc/python/grass/gunittest/case.py", line 1208, in _module_from_parameters
    module = SimpleModule(module, **kwargs)
  File "etc/python/grass/gunittest/gmodules.py", line 54, in __init__
    Module.__init__(self, cmd, *args, **kargs)
  File "etc/python/grass/pygrass/modules/interface/module.py", line 593, in __init__
    self.__call__(*args, **kargs)
  File "etc/python/grass/pygrass/modules/interface/module.py", line 640, in __call__
    raise ParameterError('%s is not a valid parameter.' % key)
ParameterError: maps is not a valid parameter.

======================================================================
ERROR: test_absolute_time_1 (__main__.TestVectorRegisterFunctions)
Register vector maps in the temporal database and in addition in a stvds using the object method
----------------------------------------------------------------------
Traceback (most recent call last):
  File "lib/python/temporal/testsuite/test_register_function.py", line 435, in tearDown
    self.runModule("t.unregister", type="vector", maps="register_map_1,register_map_2", quiet=True)
  File "etc/python/grass/gunittest/case.py", line 1077, in runModule
    module = _module_from_parameters(module, **kwargs)
  File "etc/python/grass/gunittest/case.py", line 1208, in _module_from_parameters
    module = SimpleModule(module, **kwargs)
  File "etc/python/grass/gunittest/gmodules.py", line 54, in __init__
    Module.__init__(self, cmd, *args, **kargs)
  File "etc/python/grass/pygrass/modules/interface/module.py", line 593, in __init__
    self.__call__(*args, **kargs)
  File "etc/python/grass/pygrass/modules/interface/module.py", line 640, in __call__
    raise ParameterError('%s is not a valid parameter.' % key)
ParameterError: maps is not a valid parameter.

======================================================================
ERROR: test_absolute_time_2 (__main__.TestVectorRegisterFunctions)
Register vector maps in the temporal database and in addition
----------------------------------------------------------------------
Traceback (most recent call last):
  File "lib/python/temporal/testsuite/test_register_function.py", line 435, in tearDown
    self.runModule("t.unregister", type="vector", maps="register_map_1,register_map_2", quiet=True)
  File "etc/python/grass/gunittest/case.py", line 1077, in runModule
    module = _module_from_parameters(module, **kwargs)
  File "etc/python/grass/gunittest/case.py", line 1208, in _module_from_parameters
    module = SimpleModule(module, **kwargs)
  File "etc/python/grass/gunittest/gmodules.py", line 54, in __init__
    Module.__init__(self, cmd, *args, **kargs)
  File "etc/python/grass/pygrass/modules/interface/module.py", line 593, in __init__
    self.__call__(*args, **kargs)
  File "etc/python/grass/pygrass/modules/interface/module.py", line 640, in __call__
    raise ParameterError('%s is not a valid parameter.' % key)
ParameterError: maps is not a valid parameter.

======================================================================
ERROR: test_absolute_time_stvds_1 (__main__.TestVectorRegisterFunctions)
Test the registration of maps with absolute time in a
----------------------------------------------------------------------
Traceback (most recent call last):
  File "lib/python/temporal/testsuite/test_register_function.py", line 435, in tearDown
    self.runModule("t.unregister", type="vector", maps="register_map_1,register_map_2", quiet=True)
  File "etc/python/grass/gunittest/case.py", line 1077, in runModule
    module = _module_from_parameters(module, **kwargs)
  File "etc/python/grass/gunittest/case.py", line 1208, in _module_from_parameters
    module = SimpleModule(module, **kwargs)
  File "etc/python/grass/gunittest/gmodules.py", line 54, in __init__
    Module.__init__(self, cmd, *args, **kargs)
  File "etc/python/grass/pygrass/modules/interface/module.py", line 593, in __init__
    self.__call__(*args, **kargs)
  File "etc/python/grass/pygrass/modules/interface/module.py", line 640, in __call__
    raise ParameterError('%s is not a valid parameter.' % key)
ParameterError: maps is not a valid parameter.

======================================================================
ERROR: test_absolute_time_stvds_2 (__main__.TestVectorRegisterFunctions)
Test the registration of maps with absolute time in a
----------------------------------------------------------------------
Traceback (most recent call last):
  File "lib/python/temporal/testsuite/test_register_function.py", line 435, in tearDown
    self.runModule("t.unregister", type="vector", maps="register_map_1,register_map_2", quiet=True)
  File "etc/python/grass/gunittest/case.py", line 1077, in runModule
    module = _module_from_parameters(module, **kwargs)
  File "etc/python/grass/gunittest/case.py", line 1208, in _module_from_parameters
    module = SimpleModule(module, **kwargs)
  File "etc/python/grass/gunittest/gmodules.py", line 54, in __init__
    Module.__init__(self, cmd, *args, **kargs)
  File "etc/python/grass/pygrass/modules/interface/module.py", line 593, in __init__
    self.__call__(*args, **kargs)
  File "etc/python/grass/pygrass/modules/interface/module.py", line 640, in __call__
    raise ParameterError('%s is not a valid parameter.' % key)
ParameterError: maps is not a valid parameter.

======================================================================
ERROR: test_absolute_time_stvds_3 (__main__.TestVectorRegisterFunctions)
Test the registration of maps with absolute time in a
----------------------------------------------------------------------
Traceback (most recent call last):
  File "lib/python/temporal/testsuite/test_register_function.py", line 435, in tearDown
    self.runModule("t.unregister", type="vector", maps="register_map_1,register_map_2", quiet=True)
  File "etc/python/grass/gunittest/case.py", line 1077, in runModule
    module = _module_from_parameters(module, **kwargs)
  File "etc/python/grass/gunittest/case.py", line 1208, in _module_from_parameters
    module = SimpleModule(module, **kwargs)
  File "etc/python/grass/gunittest/gmodules.py", line 54, in __init__
    Module.__init__(self, cmd, *args, **kargs)
  File "etc/python/grass/pygrass/modules/interface/module.py", line 593, in __init__
    self.__call__(*args, **kargs)
  File "etc/python/grass/pygrass/modules/interface/module.py", line 640, in __call__
    raise ParameterError('%s is not a valid parameter.' % key)
ParameterError: maps is not a valid parameter.

======================================================================
FAIL: test_absolute_time_2 (__main__.TestRasterRegisterFunctions)
Test the registration of maps with absolute time
----------------------------------------------------------------------
Traceback (most recent call last):
  File "lib/python/temporal/testsuite/test_register_function.py", line 215, in test_absolute_time_2
    self.assertEqual(start, datetime.datetime(2001, 1, 1, 10, 30, 1))
AssertionError: datetime.datetime(2001, 1, 1, 0, 0) != datetime.datetime(2001, 1, 1, 10, 30, 1)

======================================================================
FAIL: test_absolute_time_3 (__main__.TestRasterRegisterFunctions)
Test the registration of maps with absolute time.
----------------------------------------------------------------------
Traceback (most recent call last):
  File "lib/python/temporal/testsuite/test_register_function.py", line 256, in test_absolute_time_3
    self.assertEqual(start, datetime.datetime(2001, 1, 1, 10, 30, 1))
AssertionError: datetime.datetime(2001, 1, 1, 0, 0) != datetime.datetime(2001, 1, 1, 10, 30, 1)

======================================================================
FAIL: test_absolute_time_strds_3 (__main__.TestRasterRegisterFunctions)
Test the registration of maps with absolute time in a
----------------------------------------------------------------------
Traceback (most recent call last):
  File "lib/python/temporal/testsuite/test_register_function.py", line 139, in test_absolute_time_strds_3
    self.assertEqual(start, datetime.datetime(2001, 2, 1))
AssertionError: datetime.datetime(2001, 1, 1, 0, 0) != datetime.datetime(2001, 2, 1, 0, 0)

======================================================================
FAIL: test_absolute_time_strds_4 (__main__.TestRasterRegisterFunctions)
Test the registration of maps with absolute time in a
----------------------------------------------------------------------
Traceback (most recent call last):
  File "lib/python/temporal/testsuite/test_register_function.py", line 166, in test_absolute_time_strds_4
    self.assertEqual(start, datetime.datetime(2001, 2, 1))
AssertionError: datetime.datetime(2001, 1, 1, 0, 0) != datetime.datetime(2001, 2, 1, 0, 0)

======================================================================
FAIL: test_relative_time_1 (__main__.TestRasterRegisterFunctions)
Test the registration of maps with relative time
----------------------------------------------------------------------
Traceback (most recent call last):
  File "lib/python/temporal/testsuite/test_register_function.py", line 334, in test_relative_time_1
    self.assertEqual(start, 0)
AssertionError: None != 0

======================================================================
FAIL: test_relative_time_2 (__main__.TestRasterRegisterFunctions)
Test the registration of maps with relative time
----------------------------------------------------------------------
Traceback (most recent call last):
  File "lib/python/temporal/testsuite/test_register_function.py", line 355, in test_relative_time_2
    self.assertEqual(start, 1000000)
AssertionError: None != 1000000

======================================================================
FAIL: test_relative_time_3 (__main__.TestRasterRegisterFunctions)
Test the registration of maps with relative time. The timetsamps are set beforehand using
----------------------------------------------------------------------
Traceback (most recent call last):
  File "lib/python/temporal/testsuite/test_register_function.py", line 380, in test_relative_time_3
    self.assertEqual(start, 1000000)
AssertionError: None != 1000000

======================================================================
FAIL: test_absolute_time_stvds_3 (__main__.TestVectorRegisterFunctions)
Test the registration of maps with absolute time in a
----------------------------------------------------------------------
Traceback (most recent call last):
  File "lib/python/temporal/testsuite/test_register_function.py", line 514, in test_absolute_time_stvds_3
    self.assertEqual(start, datetime.datetime(2001, 2, 1))
AssertionError: datetime.datetime(2001, 1, 1, 0, 0) != datetime.datetime(2001, 2, 1, 0, 0)

----------------------------------------------------------------------
Ran 24 tests in 22.778s
FAILED (failures=8, errors=25)