test_vector_algebra stderr

/usr/lib/python2.7/dist-packages/numpy/core/__init__.py:14: DeprecationWarning: CObject type is not supported in 3.x. Please use capsule objects instead.
  from . import multiarray
/usr/lib/python2.7/dist-packages/numpy/core/__init__.py:21: DeprecationWarning: CObject type is not supported in 3.x. Please use capsule objects instead.
  from . import umath
/usr/lib/python2.7/dist-packages/numpy/random/__init__.py:99: DeprecationWarning: CObject type is not supported in 3.x. Please use capsule objects instead.
  from .mtrand import *
etc/python/grass/pygrass/raster/history.py:14: DeprecationWarning: Overriding __eq__ blocks inheritance of __hash__ in 3.x
  class History(object):
/usr/lib/python2.7/dist-packages/mx/DateTime/mxDateTime/__init__.py:9: DeprecationWarning: CObject type is not supported in 3.x. Please use capsule objects instead.
  from mxDateTime import *
/usr/lib/python2.7/dist-packages/psycopg2/__init__.py:50: DeprecationWarning: CObject type is not supported in 3.x. Please use capsule objects instead.
  from psycopg2._psycopg import BINARY, NUMBER, STRING, DATETIME, ROWID
etc/python/grass/temporal/abstract_dataset.py:569: DeprecationWarning: Overriding __eq__ blocks inheritance of __hash__ in 3.x
  class AbstractDatasetComparisonKeyStartTime(object):
etc/python/grass/temporal/abstract_dataset.py:619: DeprecationWarning: Overriding __eq__ blocks inheritance of __hash__ in 3.x
  class AbstractDatasetComparisonKeyEndTime(object):
/usr/lib/python2.7/dist-packages/dateutil/relativedelta.py:10: DeprecationWarning: Overriding __eq__ blocks inheritance of __hash__ in 3.x
  class weekday(object):
/usr/lib/python2.7/dist-packages/dateutil/relativedelta.py:41: DeprecationWarning: Overriding __eq__ blocks inheritance of __hash__ in 3.x
  class relativedelta(object):
/usr/lib/python2.7/dist-packages/dateutil/tz.py:48: DeprecationWarning: Overriding __eq__ blocks inheritance of __hash__ in 3.x
  class tzutc(datetime.tzinfo):
/usr/lib/python2.7/dist-packages/dateutil/tz.py:73: DeprecationWarning: Overriding __eq__ blocks inheritance of __hash__ in 3.x
  class tzoffset(datetime.tzinfo):
/usr/lib/python2.7/dist-packages/dateutil/tz.py:104: DeprecationWarning: Overriding __eq__ blocks inheritance of __hash__ in 3.x
  class tzlocal(datetime.tzinfo):
/usr/lib/python2.7/dist-packages/dateutil/tz.py:175: DeprecationWarning: Overriding __eq__ blocks inheritance of __hash__ in 3.x
  class _ttinfo(object):
/usr/lib/python2.7/dist-packages/dateutil/tz.py:215: DeprecationWarning: Overriding __eq__ blocks inheritance of __hash__ in 3.x
  class tzfile(datetime.tzinfo):
/usr/lib/python2.7/dist-packages/dateutil/tz.py:507: DeprecationWarning: Overriding __eq__ blocks inheritance of __hash__ in 3.x
  class tzrange(datetime.tzinfo):
Default TGIS driver / database set to:
driver: sqlite
database: $GISDBASE/$LOCATION_NAME/$MAPSET/tgis/sqlite.db
WARNING: Temporal database connection defined as:
/grassdata/tests-grassdata/piemonte_utm32_wgs84_grass7/__temporal_t_vect_algebra_test_vector_algebra/tgis/sqlite.db
But database file does not exist.
Creating temporal database: /grassdata/tests-grassdata/piemonte_utm32_wgs84_grass7/__temporal_t_vect_algebra_test_vector_algebra/tgis/sqlite.db
/usr/lib/python2.7/xml/etree/ElementTree.py:1638: DeprecationWarning: This method of XMLParser is deprecated.  Define doctype() method on the TreeBuilder target.
  DeprecationWarning,
Gathering map information...
0..100
Registering maps in the temporal database...
Registering maps in the space time dataset...
0..Updating space time dataset...
100
Gathering map information...
0..100
Registering maps in the temporal database...
Registering maps in the space time dataset...
0..Updating space time dataset...
100
Gathering map information...
0..100
Registering maps in the space time dataset...
0..Updating space time dataset...
100
Gathering map information...
0..100
Registering maps in the temporal database...
Registering maps in the space time dataset...
0..Updating space time dataset...
100
Gathering map information...
0..100
100
FEFEFEFEFEFEFE
======================================================================
ERROR: test_temporal_buff_operators_1 (__main__.TestTemporalVectorAlgebra)
Testing the bufferoperator.
----------------------------------------------------------------------
Traceback (most recent call last):
  File "temporal/t.vect.algebra/testsuite/test_vector_algebra.py", line 63, in tearDown
    self.runModule("t.remove", type="stvds", inputs="R", quiet=True)
  File "etc/python/grass/gunittest/case.py", line 1098, in runModule
    errors=errors)
CalledModuleError: Module run 1 t.remove ended with error
Process ended with non-zero return code t.remove(inputs=['R'], type='stvds', quiet=True). See errors in the (error) output.

======================================================================
ERROR: test_temporal_buff_operators_2 (__main__.TestTemporalVectorAlgebra)
Testing the bufferoperator.
----------------------------------------------------------------------
Traceback (most recent call last):
  File "temporal/t.vect.algebra/testsuite/test_vector_algebra.py", line 63, in tearDown
    self.runModule("t.remove", type="stvds", inputs="R", quiet=True)
  File "etc/python/grass/gunittest/case.py", line 1098, in runModule
    errors=errors)
CalledModuleError: Module run 1 t.remove ended with error
Process ended with non-zero return code t.remove(inputs=['R'], type='stvds', quiet=True). See errors in the (error) output.

======================================================================
ERROR: test_temporal_overlay_operators_1 (__main__.TestTemporalVectorAlgebra)
Testing the spatial overlay operator.
----------------------------------------------------------------------
Traceback (most recent call last):
  File "temporal/t.vect.algebra/testsuite/test_vector_algebra.py", line 63, in tearDown
    self.runModule("t.remove", type="stvds", inputs="R", quiet=True)
  File "etc/python/grass/gunittest/case.py", line 1098, in runModule
    errors=errors)
CalledModuleError: Module run 1 t.remove ended with error
Process ended with non-zero return code t.remove(inputs=['R'], type='stvds', quiet=True). See errors in the (error) output.

======================================================================
ERROR: test_temporal_overlay_operators_2 (__main__.TestTemporalVectorAlgebra)
Testing the spatial overlay operator.
----------------------------------------------------------------------
Traceback (most recent call last):
  File "temporal/t.vect.algebra/testsuite/test_vector_algebra.py", line 63, in tearDown
    self.runModule("t.remove", type="stvds", inputs="R", quiet=True)
  File "etc/python/grass/gunittest/case.py", line 1098, in runModule
    errors=errors)
CalledModuleError: Module run 1 t.remove ended with error
Process ended with non-zero return code t.remove(inputs=['R'], type='stvds', quiet=True). See errors in the (error) output.

======================================================================
ERROR: test_temporal_overlay_operators_3 (__main__.TestTemporalVectorAlgebra)
Testing the spatial overlay operator.
----------------------------------------------------------------------
Traceback (most recent call last):
  File "temporal/t.vect.algebra/testsuite/test_vector_algebra.py", line 63, in tearDown
    self.runModule("t.remove", type="stvds", inputs="R", quiet=True)
  File "etc/python/grass/gunittest/case.py", line 1098, in runModule
    errors=errors)
CalledModuleError: Module run 1 t.remove ended with error
Process ended with non-zero return code t.remove(inputs=['R'], type='stvds', quiet=True). See errors in the (error) output.

======================================================================
ERROR: test_temporal_select (__main__.TestTemporalVectorAlgebra)
Testing the temporal select operator.
----------------------------------------------------------------------
Traceback (most recent call last):
  File "temporal/t.vect.algebra/testsuite/test_vector_algebra.py", line 63, in tearDown
    self.runModule("t.remove", type="stvds", inputs="R", quiet=True)
  File "etc/python/grass/gunittest/case.py", line 1098, in runModule
    errors=errors)
CalledModuleError: Module run 1 t.remove ended with error
Process ended with non-zero return code t.remove(inputs=['R'], type='stvds', quiet=True). See errors in the (error) output.

======================================================================
ERROR: test_temporal_select_operators (__main__.TestTemporalVectorAlgebra)
Testing the temporal select operator. Including temporal relations.
----------------------------------------------------------------------
Traceback (most recent call last):
  File "temporal/t.vect.algebra/testsuite/test_vector_algebra.py", line 63, in tearDown
    self.runModule("t.remove", type="stvds", inputs="R", quiet=True)
  File "etc/python/grass/gunittest/case.py", line 1098, in runModule
    errors=errors)
CalledModuleError: Module run 1 t.remove ended with error
Process ended with non-zero return code t.remove(inputs=['R'], type='stvds', quiet=True). See errors in the (error) output.

======================================================================
FAIL: test_temporal_buff_operators_1 (__main__.TestTemporalVectorAlgebra)
Testing the bufferoperator.
----------------------------------------------------------------------
Traceback (most recent call last):
  File "temporal/t.vect.algebra/testsuite/test_vector_algebra.py", line 109, in test_temporal_buff_operators_1
    self.assertModule("t.vect.algebra",  expression="R = buff_p(A,0.5)", basename="r")
  File "etc/python/grass/gunittest/case.py", line 1164, in assertModule
    self.fail(self._formatMessage(msg, stdmsg))
AssertionError: Running <t.vect.algebra> module ended with non-zero return code (1)
Called: t.vect_algebra(expression='R = buff_p(A,0.5)', basename='r')
See the following errors:
ERROR: Wrong type of input A
Traceback (most recent call last):
  File "scripts/t.vect.algebra", line 80, in <module>
    sys.exit(main())
  File "scripts/t.vect.algebra", line 76, in main
    p.parse(expression, basename, grass.script.overwrite())
  File "etc/python/grass/temporal/temporal_vector_algebra.py", line 161, in parse
    self.parser.parse(expression)
  File "/usr/lib/python2.7/dist-packages/ply/yacc.py", line 331, in parse
    return self.parseopt_notrack(input, lexer, debug, tracking, tokenfunc)
  File "/usr/lib/python2.7/dist-packages/ply/yacc.py", line 1106, in parseopt_notrack
    p.callable(pslice)
  File "etc/python/grass/temporal/temporal_vector_algebra.py", line 585, in p_buffer_operation
    bufflist = self.check_stds(t[3])
  File "etc/python/grass/temporal/temporal_algebra.py", line 1226, in check_stds
    self.msgr.fatal(_("Wrong type of input " + str(input)))
  File "etc/python/grass/pygrass/messages/__init__.py", line 269, in fatal
    raise FatalError(message)
grass.exceptions.FatalError: Wrong type of input A


======================================================================
FAIL: test_temporal_buff_operators_2 (__main__.TestTemporalVectorAlgebra)
Testing the bufferoperator.
----------------------------------------------------------------------
Traceback (most recent call last):
  File "temporal/t.vect.algebra/testsuite/test_vector_algebra.py", line 126, in test_temporal_buff_operators_2
    self.assertModule("t.vect.algebra",  expression="R = buff_a(buff_p(A,1),10)", basename="r")
  File "etc/python/grass/gunittest/case.py", line 1164, in assertModule
    self.fail(self._formatMessage(msg, stdmsg))
AssertionError: Running <t.vect.algebra> module ended with non-zero return code (1)
Called: t.vect_algebra(expression='R = buff_a(buff_p(A,1),10)', basename='r')
See the following errors:
ERROR: Wrong type of input A
Traceback (most recent call last):
  File "scripts/t.vect.algebra", line 80, in <module>
    sys.exit(main())
  File "scripts/t.vect.algebra", line 76, in main
    p.parse(expression, basename, grass.script.overwrite())
  File "etc/python/grass/temporal/temporal_vector_algebra.py", line 161, in parse
    self.parser.parse(expression)
  File "/usr/lib/python2.7/dist-packages/ply/yacc.py", line 331, in parse
    return self.parseopt_notrack(input, lexer, debug, tracking, tokenfunc)
  File "/usr/lib/python2.7/dist-packages/ply/yacc.py", line 1106, in parseopt_notrack
    p.callable(pslice)
  File "etc/python/grass/temporal/temporal_vector_algebra.py", line 585, in p_buffer_operation
    bufflist = self.check_stds(t[3])
  File "etc/python/grass/temporal/temporal_algebra.py", line 1226, in check_stds
    self.msgr.fatal(_("Wrong type of input " + str(input)))
  File "etc/python/grass/pygrass/messages/__init__.py", line 269, in fatal
    raise FatalError(message)
grass.exceptions.FatalError: Wrong type of input A


======================================================================
FAIL: test_temporal_overlay_operators_1 (__main__.TestTemporalVectorAlgebra)
Testing the spatial overlay operator.
----------------------------------------------------------------------
Traceback (most recent call last):
  File "temporal/t.vect.algebra/testsuite/test_vector_algebra.py", line 143, in test_temporal_overlay_operators_1
    self.assertModule("t.vect.algebra",  expression="R = buff_p(A,2) & buff_p(D,2)", basename="r")
  File "etc/python/grass/gunittest/case.py", line 1164, in assertModule
    self.fail(self._formatMessage(msg, stdmsg))
AssertionError: Running <t.vect.algebra> module ended with non-zero return code (1)
Called: t.vect_algebra(expression='R = buff_p(A,2) & buff_p(D,2)', basename='r')
See the following errors:
ERROR: Wrong type of input A
Traceback (most recent call last):
  File "scripts/t.vect.algebra", line 80, in <module>
    sys.exit(main())
  File "scripts/t.vect.algebra", line 76, in main
    p.parse(expression, basename, grass.script.overwrite())
  File "etc/python/grass/temporal/temporal_vector_algebra.py", line 161, in parse
    self.parser.parse(expression)
  File "/usr/lib/python2.7/dist-packages/ply/yacc.py", line 331, in parse
    return self.parseopt_notrack(input, lexer, debug, tracking, tokenfunc)
  File "/usr/lib/python2.7/dist-packages/ply/yacc.py", line 1106, in parseopt_notrack
    p.callable(pslice)
  File "etc/python/grass/temporal/temporal_vector_algebra.py", line 585, in p_buffer_operation
    bufflist = self.check_stds(t[3])
  File "etc/python/grass/temporal/temporal_algebra.py", line 1226, in check_stds
    self.msgr.fatal(_("Wrong type of input " + str(input)))
  File "etc/python/grass/pygrass/messages/__init__.py", line 269, in fatal
    raise FatalError(message)
grass.exceptions.FatalError: Wrong type of input A


======================================================================
FAIL: test_temporal_overlay_operators_2 (__main__.TestTemporalVectorAlgebra)
Testing the spatial overlay operator.
----------------------------------------------------------------------
Traceback (most recent call last):
  File "temporal/t.vect.algebra/testsuite/test_vector_algebra.py", line 160, in test_temporal_overlay_operators_2
    self.assertModule("t.vect.algebra",  expression="R = buff_p(A,1.5) {&,during,r} buff_p(B,1.5)", basename="r")
  File "etc/python/grass/gunittest/case.py", line 1164, in assertModule
    self.fail(self._formatMessage(msg, stdmsg))
AssertionError: Running <t.vect.algebra> module ended with non-zero return code (1)
Called: t.vect_algebra(expression='R = buff_p(A,1.5) {&,during,r} buff_p(B,1.5)', basename='r')
See the following errors:
ERROR: Wrong type of input A
Traceback (most recent call last):
  File "scripts/t.vect.algebra", line 80, in <module>
    sys.exit(main())
  File "scripts/t.vect.algebra", line 76, in main
    p.parse(expression, basename, grass.script.overwrite())
  File "etc/python/grass/temporal/temporal_vector_algebra.py", line 161, in parse
    self.parser.parse(expression)
  File "/usr/lib/python2.7/dist-packages/ply/yacc.py", line 331, in parse
    return self.parseopt_notrack(input, lexer, debug, tracking, tokenfunc)
  File "/usr/lib/python2.7/dist-packages/ply/yacc.py", line 1106, in parseopt_notrack
    p.callable(pslice)
  File "etc/python/grass/temporal/temporal_vector_algebra.py", line 585, in p_buffer_operation
    bufflist = self.check_stds(t[3])
  File "etc/python/grass/temporal/temporal_algebra.py", line 1226, in check_stds
    self.msgr.fatal(_("Wrong type of input " + str(input)))
  File "etc/python/grass/pygrass/messages/__init__.py", line 269, in fatal
    raise FatalError(message)
grass.exceptions.FatalError: Wrong type of input A


======================================================================
FAIL: test_temporal_overlay_operators_3 (__main__.TestTemporalVectorAlgebra)
Testing the spatial overlay operator.
----------------------------------------------------------------------
Traceback (most recent call last):
  File "temporal/t.vect.algebra/testsuite/test_vector_algebra.py", line 177, in test_temporal_overlay_operators_3
    self.assertModule("t.vect.algebra",  expression="R = buff_p(A,2.5) {&,during,l} buff_p(C,2.5)", basename="r")
  File "etc/python/grass/gunittest/case.py", line 1164, in assertModule
    self.fail(self._formatMessage(msg, stdmsg))
AssertionError: Running <t.vect.algebra> module ended with non-zero return code (1)
Called: t.vect_algebra(expression='R = buff_p(A,2.5) {&,during,l} buff_p(C,2.5)', basename='r')
See the following errors:
ERROR: Wrong type of input A
Traceback (most recent call last):
  File "scripts/t.vect.algebra", line 80, in <module>
    sys.exit(main())
  File "scripts/t.vect.algebra", line 76, in main
    p.parse(expression, basename, grass.script.overwrite())
  File "etc/python/grass/temporal/temporal_vector_algebra.py", line 161, in parse
    self.parser.parse(expression)
  File "/usr/lib/python2.7/dist-packages/ply/yacc.py", line 331, in parse
    return self.parseopt_notrack(input, lexer, debug, tracking, tokenfunc)
  File "/usr/lib/python2.7/dist-packages/ply/yacc.py", line 1106, in parseopt_notrack
    p.callable(pslice)
  File "etc/python/grass/temporal/temporal_vector_algebra.py", line 585, in p_buffer_operation
    bufflist = self.check_stds(t[3])
  File "etc/python/grass/temporal/temporal_algebra.py", line 1226, in check_stds
    self.msgr.fatal(_("Wrong type of input " + str(input)))
  File "etc/python/grass/pygrass/messages/__init__.py", line 269, in fatal
    raise FatalError(message)
grass.exceptions.FatalError: Wrong type of input A


======================================================================
FAIL: test_temporal_select (__main__.TestTemporalVectorAlgebra)
Testing the temporal select operator.
----------------------------------------------------------------------
Traceback (most recent call last):
  File "temporal/t.vect.algebra/testsuite/test_vector_algebra.py", line 75, in test_temporal_select
    self.assertModule("t.vect.algebra",  expression="R = A : A", basename="r")
  File "etc/python/grass/gunittest/case.py", line 1164, in assertModule
    self.fail(self._formatMessage(msg, stdmsg))
AssertionError: Running <t.vect.algebra> module ended with non-zero return code (1)
Called: t.vect_algebra(expression='R = A : A', basename='r')
See the following errors:
ERROR: Wrong type of input A
Traceback (most recent call last):
  File "scripts/t.vect.algebra", line 80, in <module>
    sys.exit(main())
  File "scripts/t.vect.algebra", line 76, in main
    p.parse(expression, basename, grass.script.overwrite())
  File "etc/python/grass/temporal/temporal_vector_algebra.py", line 161, in parse
    self.parser.parse(expression)
  File "/usr/lib/python2.7/dist-packages/ply/yacc.py", line 331, in parse
    return self.parseopt_notrack(input, lexer, debug, tracking, tokenfunc)
  File "/usr/lib/python2.7/dist-packages/ply/yacc.py", line 1106, in parseopt_notrack
    p.callable(pslice)
  File "etc/python/grass/temporal/temporal_algebra.py", line 2752, in p_expr_t_select
    maplistA     = self.check_stds(t[1])
  File "etc/python/grass/temporal/temporal_algebra.py", line 1226, in check_stds
    self.msgr.fatal(_("Wrong type of input " + str(input)))
  File "etc/python/grass/pygrass/messages/__init__.py", line 269, in fatal
    raise FatalError(message)
grass.exceptions.FatalError: Wrong type of input A


======================================================================
FAIL: test_temporal_select_operators (__main__.TestTemporalVectorAlgebra)
Testing the temporal select operator. Including temporal relations.
----------------------------------------------------------------------
Traceback (most recent call last):
  File "temporal/t.vect.algebra/testsuite/test_vector_algebra.py", line 92, in test_temporal_select_operators
    self.assertModule("t.vect.algebra",  expression="R = A {:,during} C", basename="r")
  File "etc/python/grass/gunittest/case.py", line 1164, in assertModule
    self.fail(self._formatMessage(msg, stdmsg))
AssertionError: Running <t.vect.algebra> module ended with non-zero return code (1)
Called: t.vect_algebra(expression='R = A {:,during} C', basename='r')
See the following errors:
ERROR: Wrong type of input A
Traceback (most recent call last):
  File "scripts/t.vect.algebra", line 80, in <module>
    sys.exit(main())
  File "scripts/t.vect.algebra", line 76, in main
    p.parse(expression, basename, grass.script.overwrite())
  File "etc/python/grass/temporal/temporal_vector_algebra.py", line 161, in parse
    self.parser.parse(expression)
  File "/usr/lib/python2.7/dist-packages/ply/yacc.py", line 331, in parse
    return self.parseopt_notrack(input, lexer, debug, tracking, tokenfunc)
  File "/usr/lib/python2.7/dist-packages/ply/yacc.py", line 1106, in parseopt_notrack
    p.callable(pslice)
  File "etc/python/grass/temporal/temporal_algebra.py", line 2808, in p_expr_t_select_operator
    maplistA = self.check_stds(t[1])
  File "etc/python/grass/temporal/temporal_algebra.py", line 1226, in check_stds
    self.msgr.fatal(_("Wrong type of input " + str(input)))
  File "etc/python/grass/pygrass/messages/__init__.py", line 269, in fatal
    raise FatalError(message)
grass.exceptions.FatalError: Wrong type of input A


----------------------------------------------------------------------
Ran 7 tests in 19.158s
FAILED (failures=7, errors=7)