test_texture

./raster/r.texture – test_texture

Test failed

Testtest_texture
Testsuite./raster/r.texture
Test file./raster/r.texture/testsuite/test_texture.py
StatusFAILED
Return code1
Number of tests1
Successful tests0
Failed tests1
Percent successful0%
Test duration0:00:00.736929

Supplementary files

Standard error output (stderr)

/usr/lib/python2.7/xml/etree/ElementTree.py:1638: DeprecationWarning: This method of XMLParser is deprecated.  Define doctype() method on the TreeBuilder target.
  DeprecationWarning,
E
======================================================================
ERROR: setUpClass (__main__.TestRasterreport)
----------------------------------------------------------------------
Traceback (most recent call last):
  File "raster/r.texture/testsuite/test_texture.py", line 18, in setUpClass
    cls.runModule("g.region", raster=cls.input)
  File "etc/python/grass/gunittest/case.py", line 1098, in runModule
    errors=errors)
CalledModuleError: Module run 1 g.region ended with error
Process ended with non-zero return code g.region(raster=['lsat7_2002_80']). See the following errors:
ERROR: Raster map <lsat7_2002_80> not found

See available raster maps:
basins
elevation
geology
lakes
landsat.blue
landsat.green
landsat.red
landuse
orthophoto.blue
orthophoto.green
orthophoto.red
orthophoto.rgb


----------------------------------------------------------------------
Ran 0 tests in 0.118s
FAILED (errors=1)