test_aggregation_relative

./temporal/t.rast.aggregate – test_aggregation_relative

Test failed

Testtest_aggregation_relative
Testsuite./temporal/t.rast.aggregate
Test file./temporal/t.rast.aggregate/testsuite/test_aggregation_relative.py
StatusFAILED
Return code1
Number of tests4
Successful tests0
Failed tests4
Percent successful0%
Test duration0:00:17.104141
Tested modulest.rast.aggregate

Supplementary files

Standard error output (stderr)

/usr/lib/python2.7/dist-packages/numpy/core/__init__.py:14: DeprecationWarning: CObject type is not supported in 3.x. Please use capsule objects instead.
  from . import multiarray
/usr/lib/python2.7/dist-packages/numpy/core/__init__.py:21: DeprecationWarning: CObject type is not supported in 3.x. Please use capsule objects instead.
  from . import umath
/usr/lib/python2.7/dist-packages/numpy/random/__init__.py:99: DeprecationWarning: CObject type is not supported in 3.x. Please use capsule objects instead.
  from .mtrand import *
etc/python/grass/pygrass/raster/history.py:14: DeprecationWarning: Overriding __eq__ blocks inheritance of __hash__ in 3.x
  class History(object):
/usr/lib/python2.7/dist-packages/mx/DateTime/mxDateTime/__init__.py:9: DeprecationWarning: CObject type is not supported in 3.x. Please use capsule objects instead.
  from mxDateTime import *
/usr/lib/python2.7/dist-packages/psycopg2/__init__.py:50: DeprecationWarning: CObject type is not supported in 3.x. Please use capsule objects instead.
  from psycopg2._psycopg import BINARY, NUMBER, STRING, DATETIME, ROWID
etc/python/grass/temporal/abstract_dataset.py:569: DeprecationWarning: Overriding __eq__ blocks inheritance of __hash__ in 3.x
  class AbstractDatasetComparisonKeyStartTime(object):
etc/python/grass/temporal/abstract_dataset.py:619: DeprecationWarning: Overriding __eq__ blocks inheritance of __hash__ in 3.x
  class AbstractDatasetComparisonKeyEndTime(object):
/usr/lib/python2.7/dist-packages/dateutil/relativedelta.py:10: DeprecationWarning: Overriding __eq__ blocks inheritance of __hash__ in 3.x
  class weekday(object):
/usr/lib/python2.7/dist-packages/dateutil/relativedelta.py:41: DeprecationWarning: Overriding __eq__ blocks inheritance of __hash__ in 3.x
  class relativedelta(object):
/usr/lib/python2.7/dist-packages/dateutil/tz.py:48: DeprecationWarning: Overriding __eq__ blocks inheritance of __hash__ in 3.x
  class tzutc(datetime.tzinfo):
/usr/lib/python2.7/dist-packages/dateutil/tz.py:73: DeprecationWarning: Overriding __eq__ blocks inheritance of __hash__ in 3.x
  class tzoffset(datetime.tzinfo):
/usr/lib/python2.7/dist-packages/dateutil/tz.py:104: DeprecationWarning: Overriding __eq__ blocks inheritance of __hash__ in 3.x
  class tzlocal(datetime.tzinfo):
/usr/lib/python2.7/dist-packages/dateutil/tz.py:175: DeprecationWarning: Overriding __eq__ blocks inheritance of __hash__ in 3.x
  class _ttinfo(object):
/usr/lib/python2.7/dist-packages/dateutil/tz.py:215: DeprecationWarning: Overriding __eq__ blocks inheritance of __hash__ in 3.x
  class tzfile(datetime.tzinfo):
/usr/lib/python2.7/dist-packages/dateutil/tz.py:507: DeprecationWarning: Overriding __eq__ blocks inheritance of __hash__ in 3.x
  class tzrange(datetime.tzinfo):
Default TGIS driver / database set to:
driver: sqlite
database: $GISDBASE/$LOCATION_NAME/$MAPSET/tgis/sqlite.db
WARNING: Temporal database connection defined as:
/grassdata/tests-grassdata/piemonte_utm32_wgs84_grass7/__temporal_t_rast_aggregate_test_aggregation_relative/tgis/sqlite.db
But database file does not exist.
Creating temporal database: /grassdata/tests-grassdata/piemonte_utm32_wgs84_grass7/__temporal_t_rast_aggregate_test_aggregation_relative/tgis/sqlite.db
/usr/lib/python2.7/xml/etree/ElementTree.py:1638: DeprecationWarning: This method of XMLParser is deprecated.  Define doctype() method on the TreeBuilder target.
  DeprecationWarning,
FFFF
======================================================================
FAIL: test_1 (__main__.TestAggregationRelative)
Simple test
----------------------------------------------------------------------
Traceback (most recent call last):
  File "temporal/t.rast.aggregate/testsuite/test_aggregation_relative.py", line 78, in test_1
    precision=2, sep="=")
  File "etc/python/grass/gunittest/case.py", line 254, in assertModuleKeyValue
    self.fail(self._formatMessage(msg, stdMsg))
AssertionError: t.info input=B type=strds -g difference:
mismatch values (key, reference, actual): [('end_time', 18, u"'18'"), ('start_time', 0, u"'0'")]
command: t.info input=B type=strds -g {}

======================================================================
FAIL: test_2 (__main__.TestAggregationRelative)
Simple test register null maps
----------------------------------------------------------------------
Traceback (most recent call last):
  File "temporal/t.rast.aggregate/testsuite/test_aggregation_relative.py", line 105, in test_2
    precision=2, sep="=")
  File "etc/python/grass/gunittest/case.py", line 254, in assertModuleKeyValue
    self.fail(self._formatMessage(msg, stdMsg))
AssertionError: t.info input=B type=strds -g difference:
mismatch values (key, reference, actual): [('end_time', 27, u"'27'"), ('start_time', 0, u"'0'")]
command: t.info input=B type=strds -g {}

======================================================================
FAIL: test_3 (__main__.TestAggregationRelative)
Simple test
----------------------------------------------------------------------
Traceback (most recent call last):
  File "temporal/t.rast.aggregate/testsuite/test_aggregation_relative.py", line 132, in test_3
    precision=2, sep="=")
  File "etc/python/grass/gunittest/case.py", line 254, in assertModuleKeyValue
    self.fail(self._formatMessage(msg, stdMsg))
AssertionError: t.info input=B type=strds -g difference:
mismatch values (key, reference, actual): [('end_time', 18, u"'18'"), ('start_time', 0, u"'0'")]
command: t.info input=B type=strds -g {}

======================================================================
FAIL: test_4 (__main__.TestAggregationRelative)
Simple test
----------------------------------------------------------------------
Traceback (most recent call last):
  File "temporal/t.rast.aggregate/testsuite/test_aggregation_relative.py", line 159, in test_4
    precision=2, sep="=")
  File "etc/python/grass/gunittest/case.py", line 254, in assertModuleKeyValue
    self.fail(self._formatMessage(msg, stdMsg))
AssertionError: t.info input=B type=strds -g difference:
mismatch values (key, reference, actual): [('end_time', 21, u"'21'"), ('start_time', 0, u"'0'")]
command: t.info input=B type=strds -g {}

----------------------------------------------------------------------
Ran 4 tests in 16.153s
FAILED (failures=4)