test_raster3d_algebra stderr

/usr/lib/python2.7/dist-packages/numpy/core/__init__.py:14: DeprecationWarning: CObject type is not supported in 3.x. Please use capsule objects instead.
  from . import multiarray
/usr/lib/python2.7/dist-packages/numpy/core/__init__.py:21: DeprecationWarning: CObject type is not supported in 3.x. Please use capsule objects instead.
  from . import umath
/usr/lib/python2.7/dist-packages/numpy/random/__init__.py:99: DeprecationWarning: CObject type is not supported in 3.x. Please use capsule objects instead.
  from .mtrand import *
etc/python/grass/pygrass/raster/history.py:13: DeprecationWarning: Overriding __eq__ blocks inheritance of __hash__ in 3.x
  class History(object):
/usr/lib/python2.7/dist-packages/mx/DateTime/mxDateTime/__init__.py:9: DeprecationWarning: CObject type is not supported in 3.x. Please use capsule objects instead.
  from mxDateTime import *
/usr/lib/python2.7/dist-packages/psycopg2/__init__.py:50: DeprecationWarning: CObject type is not supported in 3.x. Please use capsule objects instead.
  from psycopg2._psycopg import BINARY, NUMBER, STRING, DATETIME, ROWID
etc/python/grass/temporal/abstract_dataset.py:569: DeprecationWarning: Overriding __eq__ blocks inheritance of __hash__ in 3.x
  class AbstractDatasetComparisonKeyStartTime(object):
etc/python/grass/temporal/abstract_dataset.py:619: DeprecationWarning: Overriding __eq__ blocks inheritance of __hash__ in 3.x
  class AbstractDatasetComparisonKeyEndTime(object):
/usr/lib/python2.7/dist-packages/dateutil/relativedelta.py:10: DeprecationWarning: Overriding __eq__ blocks inheritance of __hash__ in 3.x
  class weekday(object):
/usr/lib/python2.7/dist-packages/dateutil/relativedelta.py:41: DeprecationWarning: Overriding __eq__ blocks inheritance of __hash__ in 3.x
  class relativedelta(object):
/usr/lib/python2.7/dist-packages/dateutil/tz.py:48: DeprecationWarning: Overriding __eq__ blocks inheritance of __hash__ in 3.x
  class tzutc(datetime.tzinfo):
/usr/lib/python2.7/dist-packages/dateutil/tz.py:73: DeprecationWarning: Overriding __eq__ blocks inheritance of __hash__ in 3.x
  class tzoffset(datetime.tzinfo):
/usr/lib/python2.7/dist-packages/dateutil/tz.py:104: DeprecationWarning: Overriding __eq__ blocks inheritance of __hash__ in 3.x
  class tzlocal(datetime.tzinfo):
/usr/lib/python2.7/dist-packages/dateutil/tz.py:175: DeprecationWarning: Overriding __eq__ blocks inheritance of __hash__ in 3.x
  class _ttinfo(object):
/usr/lib/python2.7/dist-packages/dateutil/tz.py:215: DeprecationWarning: Overriding __eq__ blocks inheritance of __hash__ in 3.x
  class tzfile(datetime.tzinfo):
/usr/lib/python2.7/dist-packages/dateutil/tz.py:507: DeprecationWarning: Overriding __eq__ blocks inheritance of __hash__ in 3.x
  class tzrange(datetime.tzinfo):
Default TGIS driver / database set to:
driver: sqlite
database: $GISDBASE/$LOCATION_NAME/$MAPSET/tgis/sqlite.db
WARNING: Temporal database connection defined as:
/grassdata/tests-grassdata/piemonte_utm32_wgs84_grass7/__temporal_t_rast3d_algebra_test_raster3d_algebra/tgis/sqlite.db
But database file does not exist.
Creating temporal database: /grassdata/tests-grassdata/piemonte_utm32_wgs84_grass7/__temporal_t_rast3d_algebra_test_raster3d_algebra/tgis/sqlite.db
/usr/lib/python2.7/xml/etree/ElementTree.py:1638: DeprecationWarning: This method of XMLParser is deprecated.  Define doctype() method on the TreeBuilder target.
  DeprecationWarning,
Gathering map information...
0..100
Registering maps in the temporal database...
Registering maps in the space time dataset...
0..Updating space time dataset...
100
FEFEFE.
======================================================================
ERROR: test_temporal_neighbors_1 (__main__.TestTRast3dAlgebra)
Simple temporal neighborhood computation test
----------------------------------------------------------------------
Traceback (most recent call last):
  File "temporal/t.rast3d.algebra/testsuite/test_raster3d_algebra.py", line 43, in tearDown
    self.runModule("t.remove", type="str3ds", flags="rf", inputs="D", quiet=True)
  File "etc/python/grass/gunittest/case.py", line 1098, in runModule
    errors=errors)
CalledModuleError: Module run 1 t.remove ended with error
Process ended with non-zero return code t.remove(inputs=['D'], type='str3ds', flags=u'rf', quiet=True). See errors in the (error) output.

======================================================================
ERROR: test_temporal_neighbors_2 (__main__.TestTRast3dAlgebra)
Simple temporal neighborhood computation test
----------------------------------------------------------------------
Traceback (most recent call last):
  File "temporal/t.rast3d.algebra/testsuite/test_raster3d_algebra.py", line 43, in tearDown
    self.runModule("t.remove", type="str3ds", flags="rf", inputs="D", quiet=True)
  File "etc/python/grass/gunittest/case.py", line 1098, in runModule
    errors=errors)
CalledModuleError: Module run 1 t.remove ended with error
Process ended with non-zero return code t.remove(inputs=['D'], type='str3ds', flags=u'rf', quiet=True). See errors in the (error) output.

======================================================================
ERROR: test_temporal_neighbors_granularity (__main__.TestTRast3dAlgebra)
Simple temporal neighborhood computation test with granularity algebra
----------------------------------------------------------------------
Traceback (most recent call last):
  File "temporal/t.rast3d.algebra/testsuite/test_raster3d_algebra.py", line 43, in tearDown
    self.runModule("t.remove", type="str3ds", flags="rf", inputs="D", quiet=True)
  File "etc/python/grass/gunittest/case.py", line 1098, in runModule
    errors=errors)
CalledModuleError: Module run 1 t.remove ended with error
Process ended with non-zero return code t.remove(inputs=['D'], type='str3ds', flags=u'rf', quiet=True). See errors in the (error) output.

======================================================================
FAIL: test_temporal_neighbors_1 (__main__.TestTRast3dAlgebra)
Simple temporal neighborhood computation test
----------------------------------------------------------------------
Traceback (most recent call last):
  File "temporal/t.rast3d.algebra/testsuite/test_raster3d_algebra.py", line 56, in test_temporal_neighbors_1
    basename="d")
  File "etc/python/grass/gunittest/case.py", line 1164, in assertModule
    self.fail(self._formatMessage(msg, stdmsg))
AssertionError: Running <t.rast3d.algebra> module ended with non-zero return code (1)
Called: t.rast3d_algebra(expression='D = A[-1] + A[1]', basename='d', nprocs=1)
See the following errors:
ERROR: Wrong type of input A
Traceback (most recent call last):
  File "scripts/t.rast3d.algebra", line 109, in <module>
    sys.exit(main())
  File "scripts/t.rast3d.algebra", line 105, in main
    p.parse(expression, basename, grass.script.overwrite())
  File "etc/python/grass/temporal/temporal_raster3d_algebra.py", line 68, in parse
    self.parser.parse(expression)
  File "/usr/lib/python2.7/dist-packages/ply/yacc.py", line 331, in parse
    return self.parseopt_notrack(input, lexer, debug, tracking, tokenfunc)
  File "/usr/lib/python2.7/dist-packages/ply/yacc.py", line 1106, in parseopt_notrack
    p.callable(pslice)
  File "etc/python/grass/temporal/temporal_raster3d_algebra.py", line 92, in p_ts_neighbor_operation
    maplist = self.check_stds(t[1])
  File "etc/python/grass/temporal/temporal_algebra.py", line 1226, in check_stds
    self.msgr.fatal(_("Wrong type of input " + str(input)))
  File "etc/python/grass/pygrass/messages/__init__.py", line 269, in fatal
    raise FatalError(message)
grass.exceptions.FatalError: Wrong type of input A


======================================================================
FAIL: test_temporal_neighbors_2 (__main__.TestTRast3dAlgebra)
Simple temporal neighborhood computation test
----------------------------------------------------------------------
Traceback (most recent call last):
  File "temporal/t.rast3d.algebra/testsuite/test_raster3d_algebra.py", line 71, in test_temporal_neighbors_2
    basename="d")
  File "etc/python/grass/gunittest/case.py", line 1164, in assertModule
    self.fail(self._formatMessage(msg, stdmsg))
AssertionError: Running <t.rast3d.algebra> module ended with non-zero return code (1)
Called: t.rast3d_algebra(expression='D = A[0,0,0,-1] + A[0,0,0,1]', basename='d', nprocs=1)
See the following errors:
ERROR: Wrong type of input A
Traceback (most recent call last):
  File "scripts/t.rast3d.algebra", line 109, in <module>
    sys.exit(main())
  File "scripts/t.rast3d.algebra", line 105, in main
    p.parse(expression, basename, grass.script.overwrite())
  File "etc/python/grass/temporal/temporal_raster3d_algebra.py", line 68, in parse
    self.parser.parse(expression)
  File "/usr/lib/python2.7/dist-packages/ply/yacc.py", line 331, in parse
    return self.parseopt_notrack(input, lexer, debug, tracking, tokenfunc)
  File "/usr/lib/python2.7/dist-packages/ply/yacc.py", line 1106, in parseopt_notrack
    p.callable(pslice)
  File "etc/python/grass/temporal/temporal_raster3d_algebra.py", line 92, in p_ts_neighbor_operation
    maplist = self.check_stds(t[1])
  File "etc/python/grass/temporal/temporal_algebra.py", line 1226, in check_stds
    self.msgr.fatal(_("Wrong type of input " + str(input)))
  File "etc/python/grass/pygrass/messages/__init__.py", line 269, in fatal
    raise FatalError(message)
grass.exceptions.FatalError: Wrong type of input A


======================================================================
FAIL: test_temporal_neighbors_granularity (__main__.TestTRast3dAlgebra)
Simple temporal neighborhood computation test with granularity algebra
----------------------------------------------------------------------
Traceback (most recent call last):
  File "temporal/t.rast3d.algebra/testsuite/test_raster3d_algebra.py", line 86, in test_temporal_neighbors_granularity
    basename="d")
  File "etc/python/grass/gunittest/case.py", line 1164, in assertModule
    self.fail(self._formatMessage(msg, stdmsg))
AssertionError: Running <t.rast3d.algebra> module ended with non-zero return code (1)
Called: t.rast3d_algebra(expression='D = A[0,0,0,-1] + A[0,0,0,1]', basename='d', nprocs=1, flags=u'g')
See the following errors:
ERROR: Wrong type of input A
Traceback (most recent call last):
  File "scripts/t.rast3d.algebra", line 109, in <module>
    sys.exit(main())
  File "scripts/t.rast3d.algebra", line 105, in main
    p.parse(expression, basename, grass.script.overwrite())
  File "etc/python/grass/temporal/temporal_raster3d_algebra.py", line 68, in parse
    self.parser.parse(expression)
  File "/usr/lib/python2.7/dist-packages/ply/yacc.py", line 331, in parse
    return self.parseopt_notrack(input, lexer, debug, tracking, tokenfunc)
  File "/usr/lib/python2.7/dist-packages/ply/yacc.py", line 1106, in parseopt_notrack
    p.callable(pslice)
  File "etc/python/grass/temporal/temporal_raster3d_algebra.py", line 92, in p_ts_neighbor_operation
    maplist = self.check_stds(t[1])
  File "etc/python/grass/temporal/temporal_algebra.py", line 1226, in check_stds
    self.msgr.fatal(_("Wrong type of input " + str(input)))
  File "etc/python/grass/pygrass/messages/__init__.py", line 269, in fatal
    raise FatalError(message)
grass.exceptions.FatalError: Wrong type of input A


----------------------------------------------------------------------
Ran 4 tests in 17.413s
FAILED (failures=3, errors=3)