test_aggregation_relative stderr

/usr/lib/python2.7/dist-packages/numpy/core/__init__.py:14: DeprecationWarning: CObject type is not supported in 3.x. Please use capsule objects instead.
  from . import multiarray
/usr/lib/python2.7/dist-packages/numpy/core/__init__.py:21: DeprecationWarning: CObject type is not supported in 3.x. Please use capsule objects instead.
  from . import umath
/usr/lib/python2.7/dist-packages/numpy/random/__init__.py:99: DeprecationWarning: CObject type is not supported in 3.x. Please use capsule objects instead.
  from .mtrand import *
etc/python/grass/pygrass/raster/history.py:13: DeprecationWarning: Overriding __eq__ blocks inheritance of __hash__ in 3.x
  class History(object):
/usr/lib/python2.7/dist-packages/mx/DateTime/mxDateTime/__init__.py:9: DeprecationWarning: CObject type is not supported in 3.x. Please use capsule objects instead.
  from mxDateTime import *
/usr/lib/python2.7/dist-packages/psycopg2/__init__.py:50: DeprecationWarning: CObject type is not supported in 3.x. Please use capsule objects instead.
  from psycopg2._psycopg import BINARY, NUMBER, STRING, DATETIME, ROWID
etc/python/grass/temporal/abstract_dataset.py:569: DeprecationWarning: Overriding __eq__ blocks inheritance of __hash__ in 3.x
  class AbstractDatasetComparisonKeyStartTime(object):
etc/python/grass/temporal/abstract_dataset.py:619: DeprecationWarning: Overriding __eq__ blocks inheritance of __hash__ in 3.x
  class AbstractDatasetComparisonKeyEndTime(object):
/usr/lib/python2.7/dist-packages/dateutil/relativedelta.py:10: DeprecationWarning: Overriding __eq__ blocks inheritance of __hash__ in 3.x
  class weekday(object):
/usr/lib/python2.7/dist-packages/dateutil/relativedelta.py:41: DeprecationWarning: Overriding __eq__ blocks inheritance of __hash__ in 3.x
  class relativedelta(object):
/usr/lib/python2.7/dist-packages/dateutil/tz.py:48: DeprecationWarning: Overriding __eq__ blocks inheritance of __hash__ in 3.x
  class tzutc(datetime.tzinfo):
/usr/lib/python2.7/dist-packages/dateutil/tz.py:73: DeprecationWarning: Overriding __eq__ blocks inheritance of __hash__ in 3.x
  class tzoffset(datetime.tzinfo):
/usr/lib/python2.7/dist-packages/dateutil/tz.py:104: DeprecationWarning: Overriding __eq__ blocks inheritance of __hash__ in 3.x
  class tzlocal(datetime.tzinfo):
/usr/lib/python2.7/dist-packages/dateutil/tz.py:175: DeprecationWarning: Overriding __eq__ blocks inheritance of __hash__ in 3.x
  class _ttinfo(object):
/usr/lib/python2.7/dist-packages/dateutil/tz.py:215: DeprecationWarning: Overriding __eq__ blocks inheritance of __hash__ in 3.x
  class tzfile(datetime.tzinfo):
/usr/lib/python2.7/dist-packages/dateutil/tz.py:507: DeprecationWarning: Overriding __eq__ blocks inheritance of __hash__ in 3.x
  class tzrange(datetime.tzinfo):
Default TGIS driver / database set to:
driver: sqlite
database: $GISDBASE/$LOCATION_NAME/$MAPSET/tgis/sqlite.db
WARNING: Temporal database connection defined as:
/grassdata/tests-grassdata/piemonte_utm32_wgs84_grass7/__temporal_t_rast_aggregate_test_aggregation_relative/tgis/sqlite.db
But database file does not exist.
Creating temporal database: /grassdata/tests-grassdata/piemonte_utm32_wgs84_grass7/__temporal_t_rast_aggregate_test_aggregation_relative/tgis/sqlite.db
/usr/lib/python2.7/xml/etree/ElementTree.py:1638: DeprecationWarning: This method of XMLParser is deprecated.  Define doctype() method on the TreeBuilder target.
  DeprecationWarning,
FEFEFEFE
======================================================================
ERROR: test_1 (__main__.TestAggregationRelative)
Simple test
----------------------------------------------------------------------
Traceback (most recent call last):
  File "temporal/t.rast.aggregate/testsuite/test_aggregation_relative.py", line 52, in tearDown
    self.runModule("t.remove", flags="rf", type="strds", inputs="B")
  File "etc/python/grass/gunittest/case.py", line 1098, in runModule
    errors=errors)
CalledModuleError: Module run 1 t.remove ended with error
Process ended with non-zero return code t.remove(inputs=['B'], type='strds', flags=u'rf'). See the following errors:
ERROR: Space time raster dataset <B> not found


======================================================================
ERROR: test_2 (__main__.TestAggregationRelative)
Simple test register null maps
----------------------------------------------------------------------
Traceback (most recent call last):
  File "temporal/t.rast.aggregate/testsuite/test_aggregation_relative.py", line 52, in tearDown
    self.runModule("t.remove", flags="rf", type="strds", inputs="B")
  File "etc/python/grass/gunittest/case.py", line 1098, in runModule
    errors=errors)
CalledModuleError: Module run 1 t.remove ended with error
Process ended with non-zero return code t.remove(inputs=['B'], type='strds', flags=u'rf'). See the following errors:
ERROR: Space time raster dataset <B> not found


======================================================================
ERROR: test_3 (__main__.TestAggregationRelative)
Simple test
----------------------------------------------------------------------
Traceback (most recent call last):
  File "temporal/t.rast.aggregate/testsuite/test_aggregation_relative.py", line 52, in tearDown
    self.runModule("t.remove", flags="rf", type="strds", inputs="B")
  File "etc/python/grass/gunittest/case.py", line 1098, in runModule
    errors=errors)
CalledModuleError: Module run 1 t.remove ended with error
Process ended with non-zero return code t.remove(inputs=['B'], type='strds', flags=u'rf'). See the following errors:
ERROR: Space time raster dataset <B> not found


======================================================================
ERROR: test_4 (__main__.TestAggregationRelative)
Simple test
----------------------------------------------------------------------
Traceback (most recent call last):
  File "temporal/t.rast.aggregate/testsuite/test_aggregation_relative.py", line 52, in tearDown
    self.runModule("t.remove", flags="rf", type="strds", inputs="B")
  File "etc/python/grass/gunittest/case.py", line 1098, in runModule
    errors=errors)
CalledModuleError: Module run 1 t.remove ended with error
Process ended with non-zero return code t.remove(inputs=['B'], type='strds', flags=u'rf'). See the following errors:
ERROR: Space time raster dataset <B> not found


======================================================================
FAIL: test_1 (__main__.TestAggregationRelative)
Simple test
----------------------------------------------------------------------
Traceback (most recent call last):
  File "temporal/t.rast.aggregate/testsuite/test_aggregation_relative.py", line 60, in test_1
    nprocs=2, verbose=True)
  File "etc/python/grass/gunittest/case.py", line 1164, in assertModule
    self.fail(self._formatMessage(msg, stdmsg))
AssertionError: Running <t.rast.aggregate> module ended with non-zero return code (1)
Called: t.rast_aggregate(input='A', output='B', basename='b', suffix='gran', granularity='6', method='average', offset=0, nprocs=2, file_limit=0, sampling=['overlaps', 'overlapped', 'contains'], verbose=True)
See the following errors:
Traceback (most recent call last):
  File "scripts/t.rast.aggregate", line 219, in <module>
    main()
  File "scripts/t.rast.aggregate", line 196, in main
    overwrite=gcore.overwrite(), file_limit=file_limit)
  File "etc/python/grass/temporal/aggregation.py", line 230, in aggregate_by_topology
    topo_builder.build(mapsA=granularity_list, mapsB=map_list, spatial=spatial)
  File "etc/python/grass/temporal/spatio_temporal_relationships.py", line 552, in build
    vector.RTreeSearch2(tree, rect, list_)
ctypes.ArgumentError: argument 1: <type 'exceptions.TypeError'>: expected LP_struct_RTree instance instead of LP_struct_RTree


======================================================================
FAIL: test_2 (__main__.TestAggregationRelative)
Simple test register null maps
----------------------------------------------------------------------
Traceback (most recent call last):
  File "temporal/t.rast.aggregate/testsuite/test_aggregation_relative.py", line 86, in test_2
    nprocs=4, flags="n", verbose=True)
  File "etc/python/grass/gunittest/case.py", line 1164, in assertModule
    self.fail(self._formatMessage(msg, stdmsg))
AssertionError: Running <t.rast.aggregate> module ended with non-zero return code (1)
Called: t.rast_aggregate(input='A', output='B', basename='b', suffix='gran', granularity='9', method='maximum', offset=0, nprocs=4, file_limit=1000, sampling=['contains'], flags=u'n', verbose=True)
See the following errors:
Traceback (most recent call last):
  File "scripts/t.rast.aggregate", line 219, in <module>
    main()
  File "scripts/t.rast.aggregate", line 196, in main
    overwrite=gcore.overwrite(), file_limit=file_limit)
  File "etc/python/grass/temporal/aggregation.py", line 230, in aggregate_by_topology
    topo_builder.build(mapsA=granularity_list, mapsB=map_list, spatial=spatial)
  File "etc/python/grass/temporal/spatio_temporal_relationships.py", line 552, in build
    vector.RTreeSearch2(tree, rect, list_)
ctypes.ArgumentError: argument 1: <type 'exceptions.TypeError'>: expected LP_struct_RTree instance instead of LP_struct_RTree


======================================================================
FAIL: test_3 (__main__.TestAggregationRelative)
Simple test
----------------------------------------------------------------------
Traceback (most recent call last):
  File "temporal/t.rast.aggregate/testsuite/test_aggregation_relative.py", line 113, in test_3
    nprocs=4, verbose=True)
  File "etc/python/grass/gunittest/case.py", line 1164, in assertModule
    self.fail(self._formatMessage(msg, stdmsg))
AssertionError: Running <t.rast.aggregate> module ended with non-zero return code (1)
Called: t.rast_aggregate(input='A', output='B', basename='b', suffix='gran', granularity='9', method='maximum', offset=0, nprocs=4, file_limit=1000, sampling=['contains'], verbose=True)
See the following errors:
Traceback (most recent call last):
  File "scripts/t.rast.aggregate", line 219, in <module>
    main()
  File "scripts/t.rast.aggregate", line 196, in main
    overwrite=gcore.overwrite(), file_limit=file_limit)
  File "etc/python/grass/temporal/aggregation.py", line 230, in aggregate_by_topology
    topo_builder.build(mapsA=granularity_list, mapsB=map_list, spatial=spatial)
  File "etc/python/grass/temporal/spatio_temporal_relationships.py", line 552, in build
    vector.RTreeSearch2(tree, rect, list_)
ctypes.ArgumentError: argument 1: <type 'exceptions.TypeError'>: expected LP_struct_RTree instance instead of LP_struct_RTree


======================================================================
FAIL: test_4 (__main__.TestAggregationRelative)
Simple test
----------------------------------------------------------------------
Traceback (most recent call last):
  File "temporal/t.rast.aggregate/testsuite/test_aggregation_relative.py", line 140, in test_4
    nprocs=4, verbose=True)
  File "etc/python/grass/gunittest/case.py", line 1164, in assertModule
    self.fail(self._formatMessage(msg, stdmsg))
AssertionError: Running <t.rast.aggregate> module ended with non-zero return code (1)
Called: t.rast_aggregate(input='A', output='B', basename='b', suffix='gran', granularity='21', method='average', offset=0, nprocs=4, file_limit=1000, sampling=['contains'], verbose=True)
See the following errors:
Traceback (most recent call last):
  File "scripts/t.rast.aggregate", line 219, in <module>
    main()
  File "scripts/t.rast.aggregate", line 196, in main
    overwrite=gcore.overwrite(), file_limit=file_limit)
  File "etc/python/grass/temporal/aggregation.py", line 230, in aggregate_by_topology
    topo_builder.build(mapsA=granularity_list, mapsB=map_list, spatial=spatial)
  File "etc/python/grass/temporal/spatio_temporal_relationships.py", line 552, in build
    vector.RTreeSearch2(tree, rect, list_)
ctypes.ArgumentError: argument 1: <type 'exceptions.TypeError'>: expected LP_struct_RTree instance instead of LP_struct_RTree


----------------------------------------------------------------------
Ran 4 tests in 9.578s
FAILED (failures=4, errors=4)