test_vi

./imagery/i.vi – test_vi

Test failed

Testtest_vi
Testsuite./imagery/i.vi
Test file./imagery/i.vi/testsuite/test_vi.py
StatusFAILED
Return code1
Number of tests1
Successful tests0
Failed tests1
Percent successful0%
Test duration0:00:00.784193

Supplementary files

Standard error output (stderr)

/usr/lib/python2.7/xml/etree/ElementTree.py:1638: DeprecationWarning: This method of XMLParser is deprecated.  Define doctype() method on the TreeBuilder target.
  DeprecationWarning,
E
======================================================================
ERROR: setUpClass (__main__.TestReport)
----------------------------------------------------------------------
Traceback (most recent call last):
  File "imagery/i.vi/testsuite/test_vi.py", line 22, in setUpClass
    cls.runModule("g.region", raster='lsat5_1987_30')
  File "etc/python/grass/gunittest/case.py", line 1095, in runModule
    errors=errors)
CalledModuleError: Module run 1 g.region ended with error
Process ended with non-zero return code g.region(raster=['lsat5_1987_30']). See the following errors:
ERROR: Raster map <lsat5_1987_30> not found

See available raster maps:
basins
elevation
geology
lakes
landsat.blue
landsat.green
landsat.red
landuse
orthophoto.blue
orthophoto.green
orthophoto.red
orthophoto.rgb


----------------------------------------------------------------------
Ran 0 tests in 0.107s
FAILED (errors=1)