test_doctests

./lib/python/gunittest – test_doctests

Test failed

Testtest_doctests
Testsuite./lib/python/gunittest
Test file./lib/python/gunittest/testsuite/test_doctests.py
StatusFAILED
Return code1
Number of tests11
Successful tests10
Failed tests1
Percent successful91%
Test duration0:00:05.400711

Supplementary files

Standard error output (stderr)

... (lines omitted)
    7f1f462e9000-7f1f462ea000 rw-p 00108000 08:01 7087515                    /lib/x86_64-linux-gnu/libm-2.23.so
    7f1f462ea000-7f1f464aa000 r-xp 00000000 08:01 7121872                    /lib/x86_64-linux-gnu/libc-2.23.so
    7f1f464aa000-7f1f466aa000 ---p 001c0000 08:01 7121872                    /lib/x86_64-linux-gnu/libc-2.23.so
    7f1f466aa000-7f1f466ae000 r--p 001c0000 08:01 7121872                    /lib/x86_64-linux-gnu/libc-2.23.so
    7f1f466ae000-7f1f466b0000 rw-p 001c4000 08:01 7121872                    /lib/x86_64-linux-gnu/libc-2.23.so
    7f1f466b0000-7f1f466b4000 rw-p 00000000 00:00 0 
    7f1f466b4000-7f1f4670b000 r-xp 00000000 08:01 4993760                    /usr/lib/x86_64-linux-gnu/libproj.so.9.1.0
    7f1f4670b000-7f1f4690b000 ---p 00057000 08:01 4993760                    /usr/lib/x86_64-linux-gnu/libproj.so.9.1.0
    7f1f4690b000-7f1f4690c000 r--p 00057000 08:01 4993760                    /usr/lib/x86_64-linux-gnu/libproj.so.9.1.0
    7f1f4690c000-7f1f4690f000 rw-p 00058000 08:01 4993760                    /usr/lib/x86_64-linux-gnu/libproj.so.9.1.0
    7f1f4690f000-7f1f47411000 r-xp 00000000 08:01 4981224                    /usr/lib/libgdal.so.1.18.3
    7f1f47411000-7f1f47611000 ---p 00b02000 08:01 4981224                    /usr/lib/libgdal.so.1.18.3
    7f1f47611000-7f1f47664000 r--p 00b02000 08:01 4981224                    /usr/lib/libgdal.so.1.18.3
    7f1f47664000-7f1f47700000 rw-p 00b55000 08:01 4981224                    /usr/lib/libgdal.so.1.18.3
    7f1f47700000-7f1f47743000 rw-p 00000000 00:00 0 
    7f1f47743000-7f1f477af000 r-xp 00000000 08:01 11090632                   lib/libgrass_gis.7.5.svn.so
    7f1f477af000-7f1f479ae000 ---p 0006c000 08:01 11090632                   lib/libgrass_gis.7.5.svn.so
    7f1f479ae000-7f1f479af000 r--p 0006b000 08:01 11090632                   lib/libgrass_gis.7.5.svn.so
    7f1f479af000-7f1f479b1000 rw-p 0006c000 08:01 11090632                   lib/libgrass_gis.7.5.svn.so
    7f1f479b1000-7f1f479bc000 r-xp 00000000 08:01 11090634                   lib/libgrass_gproj.7.5.svn.so
    7f1f479bc000-7f1f47bbb000 ---p 0000b000 08:01 11090634                   lib/libgrass_gproj.7.5.svn.so
    7f1f47bbb000-7f1f47bbc000 r--p 0000a000 08:01 11090634                   lib/libgrass_gproj.7.5.svn.so
    7f1f47bbc000-7f1f47bbd000 rw-p 0000b000 08:01 11090634                   lib/libgrass_gproj.7.5.svn.so
    7f1f47bbd000-7f1f47be3000 r-xp 00000000 08:01 7121870                    /lib/x86_64-linux-gnu/ld-2.23.so
    7f1f47d81000-7f1f47db0000 rw-p 00000000 00:00 0 
    7f1f47de0000-7f1f47de2000 rw-p 00000000 00:00 0 
    7f1f47de2000-7f1f47de3000 r--p 00025000 08:01 7121870                    /lib/x86_64-linux-gnu/ld-2.23.so
    7f1f47de3000-7f1f47de4000 rw-p 00026000 08:01 7121870                    /lib/x86_64-linux-gnu/ld-2.23.so
    7f1f47de4000-7f1f47de5000 rw-p 00000000 00:00 0 
    7fff83174000-7fff83195000 rw-p 00000000 00:00 0                          [stack]
    7fff8319c000-7fff8319f000 r--p 00000000 00:00 0                          [vvar]
    7fff8319f000-7fff831a1000 r-xp 00000000 00:00 0                          [vdso]
    ffffffffff600000-ffffffffff601000 r-xp 00000000 00:00 0                  [vsyscall]
    Traceback (most recent call last):
      File "scripts/m.proj", line 308, in <module>
        main()
      File "scripts/m.proj", line 178, in main
        s = gcore.read_command("g.proj", flags='j')
      File "etc/python/grass/script/core.py", line 476, in read_command
        return handle_errors(returncode, stdout, args, kwargs)
      File "etc/python/grass/script/core.py", line 332, in handle_errors
        returncode=returncode)
    grass.exceptions.CalledModuleError: Module run None ['g.proj', '-j'] ended with error
    Process ended with non-zero return code -6. See errors in the (error) output.



----------------------------------------------------------------------
Ran 11 tests in 4.769s
FAILED (failures=1)