test_extract

./temporal/t.rast.extract – test_extract

Test failed

Testtest_extract
Testsuite./temporal/t.rast.extract
Test file./temporal/t.rast.extract/testsuite/test_extract.py
StatusFAILED
Return code1
Number of tests1
Successful tests1
Failed tests1
Percent successful100%
Test duration0:00:01.540066

Supplementary files

Standard error output (stderr)

/usr/lib/python2.7/xml/etree/ElementTree.py:1638: DeprecationWarning: This method of XMLParser is deprecated.  Define doctype() method on the TreeBuilder target.
  DeprecationWarning,
E.
======================================================================
ERROR: setUpClass (__main__.TestRasterExtraction)
----------------------------------------------------------------------
Traceback (most recent call last):
  File "temporal/t.rast.extract/testsuite/test_extract.py", line 34, in setUpClass
    description="A test", overwrite=True)
  File "etc/python/grass/gunittest/case.py", line 1095, in runModule
    errors=errors)
CalledModuleError: Module run 1 t.create ended with error
Process ended with non-zero return code t.create(output='precip_abs1', type='strds', temporaltype='absolute', semantictype='mean', title='A test', description='A test', overwrite=True). See the following errors:
Traceback (most recent call last):
  File "scripts/t.create", line 86, in <module>
    main()
  File "scripts/t.create", line 68, in main
    import grass.temporal as tgis
  File "etc/python/grass/temporal/__init__.py", line 3, in <module>
    from .core import *
  File "etc/python/grass/temporal/core.py", line 44, in <module>
    from .c_libraries_interface import *
  File "etc/python/grass/temporal/c_libraries_interface.py", line 27, in <module>
    from grass.pygrass.rpc.base import RPCServerBase
  File "etc/python/grass/pygrass/rpc/__init__.py", line 21, in <module>
    from grass.pygrass.vector import *
  File "etc/python/grass/pygrass/vector/__init__.py", line 6, in <module>
    libgis.G_gisinit('')
AttributeError: 'module' object has no attribute 'G_gisinit'


----------------------------------------------------------------------
Ran 1 test in 0.720s
FAILED (errors=1)