test_doctests

./lib/python/pygrass/modules/grid – test_doctests

Test failed

Testtest_doctests
Testsuite./lib/python/pygrass/modules/grid
Test file./lib/python/pygrass/modules/grid/testsuite/test_doctests.py
StatusFAILED
Return code1
Number of tests1
Successful tests0
Failed tests1
Percent successful0%
Test duration0:00:00.900851

Supplementary files

Standard error output (stderr)

/usr/lib/python2.7/xml/etree/ElementTree.py:1638: DeprecationWarning: This method of XMLParser is deprecated.  Define doctype() method on the TreeBuilder target.
  DeprecationWarning,
F
======================================================================
FAIL: MetaModule (grass.pygrass.modules.shortcuts)
Doctest: grass.pygrass.modules.shortcuts.MetaModule
----------------------------------------------------------------------
Traceback (most recent call last):
  File "/usr/lib/python2.7/doctest.py", line 2226, in runTest
    raise self.failureException(self.format_failure(new.getvalue()))
AssertionError: Failed doctest test for grass.pygrass.modules.shortcuts.MetaModule
  File "etc/python/grass/pygrass/modules/shortcuts.py", line 14, in MetaModule

----------------------------------------------------------------------
File "etc/python/grass/pygrass/modules/shortcuts.py", line 28, in grass.pygrass.modules.shortcuts.MetaModule
Failed example:
    g_list.outputs.stdout                         # doctest: +ELLIPSIS
Expected:
    '...basin...soils...'
Got:
    'basins\nelevation\ngeology\nlakes\nlandsat.blue\nlandsat.green\nlandsat.red\nlanduse\northophoto.blue\northophoto.green\northophoto.red\northophoto.rgb\n'


----------------------------------------------------------------------
Ran 1 test in 0.081s
FAILED (failures=1)