test_doctests

./lib/python/pygrass/modules – test_doctests

Test failed

Testtest_doctests
Testsuite./lib/python/pygrass/modules
Test file./lib/python/pygrass/modules/testsuite/test_doctests.py
StatusFAILED
Return code1
Number of tests7
Successful tests5
Failed tests2
Percent successful71%
Test duration0:01:31.948824

Supplementary files

Standard error output (stderr)

... (lines omitted)
2..5..8..11..14..17..20..23..26..2..29..5..32..8..35..11..38..14..41..17..20..44..23..47..26..50..29..53..32..56..35..59..38..62..41..65..44..68..47..71..50..74..53..56..77..59..80..62..83..65..86..68..71..89..74..92..77..95..80..98..83..100
86..Aspect raster map <aspect> complete
Slope raster map <slope> complete
89..92..95..98..100
Aspect raster map <aspect> complete
Slope raster map <slope> complete
.F....F
======================================================================
FAIL: copy_mapset (grass.pygrass.modules.grid.grid)
Doctest: grass.pygrass.modules.grid.grid.copy_mapset
----------------------------------------------------------------------
Traceback (most recent call last):
  File "/usr/lib/python2.7/doctest.py", line 2226, in runTest
    raise self.failureException(self.format_failure(new.getvalue()))
AssertionError: Failed doctest test for grass.pygrass.modules.grid.grid.copy_mapset
  File "etc/python/grass/pygrass/modules/grid/grid.py", line 63, in copy_mapset

----------------------------------------------------------------------
File "etc/python/grass/pygrass/modules/grid/grid.py", line 85, in grass.pygrass.modules.grid.grid.copy_mapset
Failed example:
    sorted(os.listdir(os.path.join(path, 'PERMANENT')))
Expected:
    [u'DEFAULT_WIND', u'PROJ_EPSG', u'PROJ_INFO', u'PROJ_UNITS', u'VAR', u'WIND']
Got:
    [u'CURGROUP', u'DEFAULT_WIND', u'MYNAME', u'PROJ_INFO', u'PROJ_UNITS', u'VAR', u'WIND']


======================================================================
FAIL: MetaModule (grass.pygrass.modules.shortcuts)
Doctest: grass.pygrass.modules.shortcuts.MetaModule
----------------------------------------------------------------------
Traceback (most recent call last):
  File "/usr/lib/python2.7/doctest.py", line 2226, in runTest
    raise self.failureException(self.format_failure(new.getvalue()))
AssertionError: Failed doctest test for grass.pygrass.modules.shortcuts.MetaModule
  File "etc/python/grass/pygrass/modules/shortcuts.py", line 14, in MetaModule

----------------------------------------------------------------------
File "etc/python/grass/pygrass/modules/shortcuts.py", line 28, in grass.pygrass.modules.shortcuts.MetaModule
Failed example:
    g_list.outputs.stdout                         # doctest: +ELLIPSIS
Expected:
    '...basin...soils...'
Got:
    'basins\nelevation\ngeology\nlakes\nlandsat.blue\nlandsat.green\nlandsat.red\nlanduse\northophoto.blue\northophoto.green\northophoto.red\northophoto.rgb\n'


----------------------------------------------------------------------
Ran 7 tests in 90.973s
FAILED (failures=2)