test_to_vect

./temporal/t.rast.to.vect – test_to_vect

Test failed

Testtest_to_vect
Testsuite./temporal/t.rast.to.vect
Test file./temporal/t.rast.to.vect/testsuite/test_to_vect.py
StatusFAILED
Return code1
Number of tests8
Successful tests2
Failed tests12
Percent successful25%
Test duration0:00:14.636184
Tested modulest.rast.to.vect

Supplementary files

Standard error output (stderr)

... (lines omitted)
    self.fail(self._formatMessage(msg, stdmsg))
AssertionError: Running <t.rast.to.vect> module ended with non-zero return code (1)
Called: t.rast_to_vect(input='A', output='result', type='point', basename='test', suffix='gran', column='values', nprocs=1, flags=u'n', overwrite=True, verbose=True)
See the following errors:
Traceback (most recent call last):
  File "scripts/t.rast.to.vect", line 274, in <module>
    main(options, flags)
  File "scripts/t.rast.to.vect", line 213, in main
    mod(input=map.get_id(), output=new_map.get_id())
  File "etc/python/grass/pygrass/modules/interface/module.py", line 566, in __call__
    self.outputs[key].value = val
  File "etc/python/grass/pygrass/modules/interface/parameter.py", line 189, in _set_value
    self._value, self._rawvalue = _check_value(self, value)
  File "etc/python/grass/pygrass/modules/interface/parameter.py", line 77, in _check_value
    check_string(value)
  File "etc/python/grass/pygrass/modules/interface/parameter.py", line 47, in check_string
    raise ValueError(msg % (param.name, type(value), value))
ValueError: The Parameter <output> require a string, <type 'unicode'> instead is provided: u'test_2001_01@__temporal_t_rast_to_vect_test_to_vect'


======================================================================
FAIL: test_time_suffix (__main__.TestRasterToVector)
----------------------------------------------------------------------
Traceback (most recent call last):
  File "temporal/t.rast.to.vect/testsuite/test_to_vect.py", line 145, in test_time_suffix
    nprocs=4, overwrite=True, verbose=True)
  File "etc/python/grass/gunittest/case.py", line 1161, in assertModule
    self.fail(self._formatMessage(msg, stdmsg))
AssertionError: Running <t.rast.to.vect> module ended with non-zero return code (1)
Called: t.rast_to_vect(input='A', output='result', type='point', basename='test', suffix='time', column='values', nprocs=4, flags=u't', overwrite=True, verbose=True)
See the following errors:
Traceback (most recent call last):
  File "scripts/t.rast.to.vect", line 274, in <module>
    main(options, flags)
  File "scripts/t.rast.to.vect", line 213, in main
    mod(input=map.get_id(), output=new_map.get_id())
  File "etc/python/grass/pygrass/modules/interface/module.py", line 566, in __call__
    self.outputs[key].value = val
  File "etc/python/grass/pygrass/modules/interface/parameter.py", line 189, in _set_value
    self._value, self._rawvalue = _check_value(self, value)
  File "etc/python/grass/pygrass/modules/interface/parameter.py", line 77, in _check_value
    check_string(value)
  File "etc/python/grass/pygrass/modules/interface/parameter.py", line 47, in check_string
    raise ValueError(msg % (param.name, type(value), value))
ValueError: The Parameter <output> require a string, <type 'unicode'> instead is provided: u'test_2001_01_01T00_00_00@__temporal_t_rast_to_vect_test_to_vect'


----------------------------------------------------------------------
Ran 8 tests in 13.801s
FAILED (failures=6, errors=6)