r_grow_distance_test

./raster/r.grow.distance – r_grow_distance_test

Test failed

Testr_grow_distance_test
Testsuite./raster/r.grow.distance
Test file./raster/r.grow.distance/testsuite/r_grow_distance_test.py
StatusFAILED
Return code1
Number of tests1
Successful tests0
Failed tests1
Percent successful0%
Test duration0:00:30.916144
Tested modulesr.grow.distance

Supplementary files

Standard error output (stderr)

/usr/lib/python2.7/xml/etree/ElementTree.py:1627: DeprecationWarning: This method of XMLParser is deprecated.  Define doctype() method on the TreeBuilder target.
  DeprecationWarning,
F
======================================================================
FAIL: test_grow (__main__.TestGrowDistance)
Test to see if the outputs are created
----------------------------------------------------------------------
Traceback (most recent call last):
  File "raster/r.grow.distance/testsuite/r_grow_distance_test.py", line 48, in test_grow
    msg='distance output not in range')
  File "etc/python/grass/gunittest/case.py", line 474, in assertRasterMinMax
    self.fail(self._formatMessage(msg, stdmsg))
AssertionError: distance output not in range 
The actual maximum (112623.759705) is greater than the reference one (5322) for raster map test_distance (with minimum 0)

----------------------------------------------------------------------
Ran 1 test in 30.107s
FAILED (failures=1)