test_r_horizon

./raster/r.horizon – test_r_horizon

Test failed

Testtest_r_horizon
Testsuite./raster/r.horizon
Test file./raster/r.horizon/testsuite/test_r_horizon.py
StatusFAILED
Return code1
Number of tests1
Successful tests0
Failed tests1
Percent successful0%
Test duration0:00:00.903028

Supplementary files

Standard error output (stderr)

E
======================================================================
ERROR: setUpClass (__main__.TestHorizon)
----------------------------------------------------------------------
Traceback (most recent call last):
  File "raster/r.horizon/testsuite/test_r_horizon.py", line 74, in setUpClass
    cls.use_temp_region()
  File "etc/python/grass/gunittest/case.py", line 119, in use_temp_region
    call_module("g.region", save=name, overwrite=True)
  File "etc/python/grass/gunittest/gmodules.py", line 131, in call_module
    raise CalledModuleError(returncode, module, kwargs, errors)
CalledModuleError: Module run 1 g.region ended with error
Process ended with non-zero return code {'save': 'tmp.TestHorizon', 'stderr': -1, 'overwrite': True, 'stdout': -1}. See the following errors:
ERROR: Unable to make mapset element windows (/grassdata/tests-grassdata/piemonte_utm32_wgs84_grass7/__raster_r_horizon_test_r_horizon/windows): No space left on device


----------------------------------------------------------------------
Ran 0 tests in 0.035s
FAILED (errors=1)