test_v_net stderr

etc/python/grass/lib/gis.py:801: DeprecationWarning: classic int division
  ('__val', c_ulong * (1024 / (8 * sizeof(c_ulong)))),
/usr/lib/python2.7/xml/etree/ElementTree.py:1627: DeprecationWarning: This method of XMLParser is deprecated.  Define doctype() method on the TreeBuilder target.
  DeprecationWarning,
FFFF
======================================================================
FAIL: test_connect (__main__.TestVNet)
Test
----------------------------------------------------------------------
Traceback (most recent call last):
  File "vector/v.net/testsuite/test_v_net.py", line 35, in test_connect
    output=self.network, operation='connect', threshold=1000)
  File "etc/python/grass/gunittest/case.py", line 1132, in assertModule
    self.fail(self._formatMessage(msg, stdmsg))
AssertionError: Running <v.net> module ended with non-zero return code (1)
Called: v.net(input='streets_wake', points='schools_wake', output='test_vnet', operation='connect', arc_layer='1', arc_type=['line', 'boundary'], node_layer='2', threshold=1000.0, turn_layer='3', turn_cat_layer='4')
See the folowing errors:
ERROR: Vector map <streets_wake> not found


======================================================================
FAIL: test_connect_snap (__main__.TestVNet)
Test
----------------------------------------------------------------------
Traceback (most recent call last):
  File "vector/v.net/testsuite/test_v_net.py", line 44, in test_connect_snap
    output=self.network, operation='connect', threshold=1000)
  File "etc/python/grass/gunittest/case.py", line 1132, in assertModule
    self.fail(self._formatMessage(msg, stdmsg))
AssertionError: Running <v.net> module ended with non-zero return code (1)
Called: v.net(input='streets_wake', points='schools_wake', output='test_vnet', operation='connect', arc_layer='1', arc_type=['line', 'boundary'], node_layer='2', threshold=1000.0, turn_layer='3', turn_cat_layer='4', flags=u's')
See the folowing errors:
ERROR: Vector map <streets_wake> not found


======================================================================
FAIL: test_nodes (__main__.TestVNet)
Test
----------------------------------------------------------------------
Traceback (most recent call last):
  File "vector/v.net/testsuite/test_v_net.py", line 18, in test_nodes
    self.assertModule('v.net', input='streets_wake', output=self.network, operation='nodes')
  File "etc/python/grass/gunittest/case.py", line 1132, in assertModule
    self.fail(self._formatMessage(msg, stdmsg))
AssertionError: Running <v.net> module ended with non-zero return code (1)
Called: v.net(input='streets_wake', output='test_vnet', operation='nodes', arc_layer='1', arc_type=['line', 'boundary'], node_layer='2', turn_layer='3', turn_cat_layer='4')
See the folowing errors:
ERROR: Vector map <streets_wake> not found


======================================================================
FAIL: test_nodes_layers (__main__.TestVNet)
Test
----------------------------------------------------------------------
Traceback (most recent call last):
  File "vector/v.net/testsuite/test_v_net.py", line 26, in test_nodes_layers
    self.assertModule('v.net', input='streets_wake', output=self.network, operation='nodes', flags='c')
  File "etc/python/grass/gunittest/case.py", line 1132, in assertModule
    self.fail(self._formatMessage(msg, stdmsg))
AssertionError: Running <v.net> module ended with non-zero return code (1)
Called: v.net(input='streets_wake', output='test_vnet', operation='nodes', arc_layer='1', arc_type=['line', 'boundary'], node_layer='2', turn_layer='3', turn_cat_layer='4', flags=u'c')
See the folowing errors:
ERROR: Vector map <streets_wake> not found


----------------------------------------------------------------------
Ran 4 tests in 0.318s
FAILED (failures=4)