test_strds_to_rast3

./temporal/t.rast.to.rast3 – test_strds_to_rast3

Test failed

Testtest_strds_to_rast3
Testsuite./temporal/t.rast.to.rast3
Test file./temporal/t.rast.to.rast3/testsuite/test_strds_to_rast3.py
StatusFAILED
Return code1
Number of tests1
Successful tests0
Failed tests1
Percent successful0%
Test duration0:00:01.186927

Supplementary files

Standard error output (stderr)

etc/python/grass/lib/gis.py:797: DeprecationWarning: classic int division
  ('__val', c_ulong * (1024 / (8 * sizeof(c_ulong)))),
/usr/lib/python2.7/xml/etree/ElementTree.py:1627: DeprecationWarning: This method of XMLParser is deprecated.  Define doctype() method on the TreeBuilder target.
  DeprecationWarning,
E
======================================================================
ERROR: test_3m_gap (__main__.TestSTRDSToRast3)
Convert STRDS with gaps into 3d raster map, granularity 3 months
----------------------------------------------------------------------
Traceback (most recent call last):
  File "temporal/t.rast.to.rast3/testsuite/test_strds_to_rast3.py", line 22, in setUp
    self.runModule("g.gisenv",  set="TGIS_USE_CURRENT_MAPSET=1")
  File "etc/python/grass/gunittest/case.py", line 932, in runModule
    module = _module_from_parameters(module, **kwargs)
  File "etc/python/grass/gunittest/case.py", line 1060, in _module_from_parameters
    module = SimpleModule(module, **kwargs)
  File "etc/python/grass/gunittest/gmodules.py", line 54, in __init__
    Module.__init__(self, cmd, *args, **kargs)
  File "etc/python/grass/pygrass/modules/interface/module.py", line 507, in __init__
    self.__setattr__(e.tag, GETFROMTAG[e.tag](e))
KeyError: 'rules'

----------------------------------------------------------------------
Ran 1 test in 0.034s
FAILED (errors=1)