test_r_slope_aspect

./raster/r.slope.aspect – test_r_slope_aspect

Test failed

Test filetest_r_slope_aspect
Testsuite./raster/r.slope.aspect
StatusFAILED
Return code1
Number of tests5
Successful tests3
Failed tests4
Percent successful60%
Test duration0:00:01.547537
Tested modulesr.slope.aspect

Supplementary files

Standard error output (stderr)

etc/python/grass/lib/gis.py:807: DeprecationWarning: classic int division
  ('__val', c_ulong * (1024 / (8 * sizeof(c_ulong)))),
/usr/lib/python2.7/xml/etree/ElementTree.py:1627: DeprecationWarning: This method of XMLParser is deprecated.  Define doctype() method on the TreeBuilder target.
  DeprecationWarning,
.FFE..E
======================================================================
ERROR: setUpClass (__main__.TestSlopeAspectAgainstItself)
----------------------------------------------------------------------
Traceback (most recent call last):
  File "raster/r.slope.aspect/testsuite/test_r_slope_aspect.py", line 112, in setUpClass
    call_module('g.region', rast='elevation')
  File "etc/python/grass/gunittest/gmodules.py", line 129, in call_module
    raise CalledModuleError(returncode, module, kwargs, errors)
CalledModuleError: Module run 1 g.region ended with error
Process ended with non-zero return code {'rast': 'elevation', 'stderr': -1, 'stdout': -1}. See the following errors:
ERROR: Raster map <elevation> not found


======================================================================
ERROR: tearDownClass (__main__.TestSlopeAspectAgainstReference)
----------------------------------------------------------------------
Traceback (most recent call last):
  File "raster/r.slope.aspect/testsuite/test_r_slope_aspect.py", line 71, in tearDownClass
    cls.runModule('g.remove', flags='f', type='rast', name=cls.elevation)
  File "etc/python/grass/gunittest/case.py", line 932, in runModule
    module = _module_from_parameters(module, **kwargs)
  File "etc/python/grass/gunittest/case.py", line 1060, in _module_from_parameters
    module = SimpleModule(module, **kwargs)
  File "etc/python/grass/gunittest/gmodules.py", line 54, in __init__
    Module.__init__(self, cmd, *args, **kargs)
  File "etc/python/grass/pygrass/modules/interface/module.py", line 556, in __init__
    self.__call__(*args, **kargs)
  File "etc/python/grass/pygrass/modules/interface/module.py", line 594, in __call__
    self.inputs[key].value = val
  File "etc/python/grass/pygrass/modules/interface/parameter.py", line 183, in _set_value
    self._value, self._rawvalue = _check_value(self, value)
  File "etc/python/grass/pygrass/modules/interface/parameter.py", line 91, in _check_value
    raise ValueError(must_val % (param.name, param.values))
ValueError: The Parameter <type>, must be one of the following values: ['raster', '3draster', 'vector', 'oldvector', 'asciivector', 'labels', 'region', 'group', 'all']

======================================================================
FAIL: test_limits (__main__.TestSlopeAspect)
----------------------------------------------------------------------
Traceback (most recent call last):
  File "raster/r.slope.aspect/testsuite/test_r_slope_aspect.py", line 25, in test_limits
    slope=slope, aspect=aspect)
  File "etc/python/grass/gunittest/case.py", line 1016, in assertModule
    self.fail(self._formatMessage(msg, stdmsg))
AssertionError: Running <r.slope.aspect> module ended with non-zero return code (1)
Called: r.slope_aspect(elevation='elevation', slope='limits_slope', aspect='limits_aspect', format='degrees', precision='FCELL', zscale=1.0, min_slope=0.0)
See the folowing errors:
ERROR: Raster map <elevation> not found


======================================================================
FAIL: test_limits_precent (__main__.TestSlopeAspect)
----------------------------------------------------------------------
Traceback (most recent call last):
  File "raster/r.slope.aspect/testsuite/test_r_slope_aspect.py", line 35, in test_limits_precent
    slope=slope, aspect=aspect, format='percent')
  File "etc/python/grass/gunittest/case.py", line 1016, in assertModule
    self.fail(self._formatMessage(msg, stdmsg))
AssertionError: Running <r.slope.aspect> module ended with non-zero return code (1)
Called: r.slope_aspect(elevation='elevation', slope='limits_percent_slope', aspect='limits_percent_aspect', format='percent', precision='FCELL', zscale=1.0, min_slope=0.0)
See the folowing errors:
ERROR: Raster map <elevation> not found


----------------------------------------------------------------------
Ran 5 tests in 0.525s
FAILED (failures=2, errors=2)