r3flow_test

./raster3d/r3.flow – r3flow_test

Test failed

Test filer3flow_test
Testsuite./raster3d/r3.flow
StatusFAILED
Return code1
Number of tests2
Successful tests1
Failed tests2
Percent successful50%
Test duration0:00:01.606415
Tested modulesr3.flow

Supplementary files

Standard error output (stderr)

etc/python/grass/lib/gis.py:807: DeprecationWarning: classic int division
  ('__val', c_ulong * (1024 / (8 * sizeof(c_ulong)))),
/usr/lib/python2.7/xml/etree/ElementTree.py:1627: DeprecationWarning: This method of XMLParser is deprecated.  Define doctype() method on the TreeBuilder target.
  DeprecationWarning,
E.E
======================================================================
ERROR: test_flowlines (__main__.FlowlineTest)
----------------------------------------------------------------------
Traceback (most recent call last):
  File "raster3d/r3.flow/testsuite/r3flow_test.py", line 89, in test_flowlines
    dp=6)
  File "etc/python/grass/gunittest/case.py", line 932, in runModule
    module = _module_from_parameters(module, **kwargs)
  File "etc/python/grass/gunittest/case.py", line 1060, in _module_from_parameters
    module = SimpleModule(module, **kwargs)
  File "etc/python/grass/gunittest/gmodules.py", line 54, in __init__
    Module.__init__(self, cmd, *args, **kargs)
  File "etc/python/grass/pygrass/modules/interface/module.py", line 556, in __init__
    self.__call__(*args, **kargs)
  File "etc/python/grass/pygrass/modules/interface/module.py", line 602, in __call__
    raise ParameterError('%s is not a valid parameter.' % key)
ParameterError: dp is not a valid parameter.

======================================================================
ERROR: tearDownClass (__main__.FlowlineTest)
----------------------------------------------------------------------
Traceback (most recent call last):
  File "raster3d/r3.flow/testsuite/r3flow_test.py", line 57, in tearDownClass
    cls.runModule('g.remove', flags='f', type='rast3d', name=','.join(['map_1', 'map_2', 'map_3', 'map_4', 'map_5', 'test_flowaccum']))
  File "etc/python/grass/gunittest/case.py", line 932, in runModule
    module = _module_from_parameters(module, **kwargs)
  File "etc/python/grass/gunittest/case.py", line 1060, in _module_from_parameters
    module = SimpleModule(module, **kwargs)
  File "etc/python/grass/gunittest/gmodules.py", line 54, in __init__
    Module.__init__(self, cmd, *args, **kargs)
  File "etc/python/grass/pygrass/modules/interface/module.py", line 556, in __init__
    self.__call__(*args, **kargs)
  File "etc/python/grass/pygrass/modules/interface/module.py", line 594, in __call__
    self.inputs[key].value = val
  File "etc/python/grass/pygrass/modules/interface/parameter.py", line 183, in _set_value
    self._value, self._rawvalue = _check_value(self, value)
  File "etc/python/grass/pygrass/modules/interface/parameter.py", line 91, in _check_value
    raise ValueError(must_val % (param.name, param.values))
ValueError: The Parameter <type>, must be one of the following values: ['raster', '3draster', 'vector', 'oldvector', 'asciivector', 'labels', 'region', 'group', 'all']

----------------------------------------------------------------------
Ran 2 tests in 0.667s
FAILED (errors=2)