test_strds_to_rast3

./temporal/t.rast.to.rast3 – test_strds_to_rast3

Test failed

Test filetest_strds_to_rast3
Testsuite./temporal/t.rast.to.rast3
StatusFAILED
Return code1
Number of tests1
Successful tests0
Failed tests1
Percent successful0%
Test duration0:00:02.016986

Supplementary files

Standard error output (stderr)

etc/python/grass/lib/gis.py:807: DeprecationWarning: classic int division
  ('__val', c_ulong * (1024 / (8 * sizeof(c_ulong)))),
/usr/lib/python2.7/xml/etree/ElementTree.py:1627: DeprecationWarning: This method of XMLParser is deprecated.  Define doctype() method on the TreeBuilder target.
  DeprecationWarning,
E
======================================================================
ERROR: test_3m_gap (__main__.TestSTRDSToRast3)
Convert STRDS with gaps into 3d raster map, granularity 3 months
----------------------------------------------------------------------
Traceback (most recent call last):
  File "temporal/t.rast.to.rast3/testsuite/test_strds_to_rast3.py", line 51, in setUp
    start="2001-01-01", increment="3 months")
  File "etc/python/grass/gunittest/case.py", line 932, in runModule
    module = _module_from_parameters(module, **kwargs)
  File "etc/python/grass/gunittest/case.py", line 1060, in _module_from_parameters
    module = SimpleModule(module, **kwargs)
  File "etc/python/grass/gunittest/gmodules.py", line 54, in __init__
    Module.__init__(self, cmd, *args, **kargs)
  File "etc/python/grass/pygrass/modules/interface/module.py", line 556, in __init__
    self.__call__(*args, **kargs)
  File "etc/python/grass/pygrass/modules/interface/module.py", line 594, in __call__
    self.inputs[key].value = val
  File "etc/python/grass/pygrass/modules/interface/parameter.py", line 183, in _set_value
    self._value, self._rawvalue = _check_value(self, value)
  File "etc/python/grass/pygrass/modules/interface/parameter.py", line 91, in _check_value
    raise ValueError(must_val % (param.name, param.values))
ValueError: The Parameter <type>, must be one of the following values: ['raster', 'vector', '3draster']

----------------------------------------------------------------------
Ran 1 test in 1.008s
FAILED (errors=1)