test_extract

./temporal/t.rast.extract – test_extract

Test failed

Test filetest_extract
Testsuite./temporal/t.rast.extract
StatusFAILED
Return code1
Number of tests4
Successful tests1
Failed tests3
Percent successful25%
Test duration0:00:04.768037

Supplementary files

Standard error output (stderr)

etc/python/grass/lib/gis.py:807: DeprecationWarning: classic int division
  ('__val', c_ulong * (1024 / (8 * sizeof(c_ulong)))),
/usr/lib/python2.7/xml/etree/ElementTree.py:1627: DeprecationWarning: This method of XMLParser is deprecated.  Define doctype() method on the TreeBuilder target.
  DeprecationWarning,
EEE.
======================================================================
ERROR: test_expression_with_empty_maps (__main__.TestRasterExtraction)
Perform r.mapcalc expression and register empty maps
----------------------------------------------------------------------
Traceback (most recent call last):
  File "temporal/t.rast.extract/testsuite/test_extract.py", line 47, in setUp
    start="2001-01-01", increment="3 months",  overwrite=True)
  File "etc/python/grass/gunittest/case.py", line 932, in runModule
    module = _module_from_parameters(module, **kwargs)
  File "etc/python/grass/gunittest/case.py", line 1060, in _module_from_parameters
    module = SimpleModule(module, **kwargs)
  File "etc/python/grass/gunittest/gmodules.py", line 54, in __init__
    Module.__init__(self, cmd, *args, **kargs)
  File "etc/python/grass/pygrass/modules/interface/module.py", line 556, in __init__
    self.__call__(*args, **kargs)
  File "etc/python/grass/pygrass/modules/interface/module.py", line 594, in __call__
    self.inputs[key].value = val
  File "etc/python/grass/pygrass/modules/interface/parameter.py", line 183, in _set_value
    self._value, self._rawvalue = _check_value(self, value)
  File "etc/python/grass/pygrass/modules/interface/parameter.py", line 91, in _check_value
    raise ValueError(must_val % (param.name, param.values))
ValueError: The Parameter <type>, must be one of the following values: ['raster', 'vector', '3draster']

======================================================================
ERROR: test_selection (__main__.TestRasterExtraction)
Perform a simple selection by datetime
----------------------------------------------------------------------
Traceback (most recent call last):
  File "temporal/t.rast.extract/testsuite/test_extract.py", line 47, in setUp
    start="2001-01-01", increment="3 months",  overwrite=True)
  File "etc/python/grass/gunittest/case.py", line 932, in runModule
    module = _module_from_parameters(module, **kwargs)
  File "etc/python/grass/gunittest/case.py", line 1060, in _module_from_parameters
    module = SimpleModule(module, **kwargs)
  File "etc/python/grass/gunittest/gmodules.py", line 54, in __init__
    Module.__init__(self, cmd, *args, **kargs)
  File "etc/python/grass/pygrass/modules/interface/module.py", line 556, in __init__
    self.__call__(*args, **kargs)
  File "etc/python/grass/pygrass/modules/interface/module.py", line 594, in __call__
    self.inputs[key].value = val
  File "etc/python/grass/pygrass/modules/interface/parameter.py", line 183, in _set_value
    self._value, self._rawvalue = _check_value(self, value)
  File "etc/python/grass/pygrass/modules/interface/parameter.py", line 91, in _check_value
    raise ValueError(must_val % (param.name, param.values))
ValueError: The Parameter <type>, must be one of the following values: ['raster', 'vector', '3draster']

======================================================================
ERROR: test_selection_and_expression (__main__.TestRasterExtraction)
Perform a selection by datetime and a r.mapcalc expression
----------------------------------------------------------------------
Traceback (most recent call last):
  File "temporal/t.rast.extract/testsuite/test_extract.py", line 47, in setUp
    start="2001-01-01", increment="3 months",  overwrite=True)
  File "etc/python/grass/gunittest/case.py", line 932, in runModule
    module = _module_from_parameters(module, **kwargs)
  File "etc/python/grass/gunittest/case.py", line 1060, in _module_from_parameters
    module = SimpleModule(module, **kwargs)
  File "etc/python/grass/gunittest/gmodules.py", line 54, in __init__
    Module.__init__(self, cmd, *args, **kargs)
  File "etc/python/grass/pygrass/modules/interface/module.py", line 556, in __init__
    self.__call__(*args, **kargs)
  File "etc/python/grass/pygrass/modules/interface/module.py", line 594, in __call__
    self.inputs[key].value = val
  File "etc/python/grass/pygrass/modules/interface/parameter.py", line 183, in _set_value
    self._value, self._rawvalue = _check_value(self, value)
  File "etc/python/grass/pygrass/modules/interface/parameter.py", line 91, in _check_value
    raise ValueError(must_val % (param.name, param.values))
ValueError: The Parameter <type>, must be one of the following values: ['raster', 'vector', '3draster']

----------------------------------------------------------------------
Ran 4 tests in 3.751s
FAILED (errors=3)