test_raster_algebra_granularity_fails

./temporal/t.rast.algebra – test_raster_algebra_granularity_fails

Test failed

Test filetest_raster_algebra_granularity_fails
Testsuite./temporal/t.rast.algebra
StatusFAILED
Return code1
Number of tests1
Successful tests1
Failed tests1
Percent successful100%
Test duration0:00:05.522991

Supplementary files

Standard error output (stderr)

etc/python/grass/lib/gis.py:807: DeprecationWarning: classic int division
  ('__val', c_ulong * (1024 / (8 * sizeof(c_ulong)))),
/usr/lib/python2.7/dist-packages/mx/DateTime/mxDateTime/__init__.py:9: DeprecationWarning: CObject type is not supported in 3.x. Please use capsule objects instead.
  from mxDateTime import *
/usr/lib/python2.7/dist-packages/mx/DateTime/DateTime.py:563: DeprecationWarning: classic int division
  MaxDateTime = DateTime(_sys.maxint / 366 - 1, 12, 31)
/usr/lib/python2.7/dist-packages/mx/DateTime/DateTime.py:564: DeprecationWarning: classic int division
  MinDateTime = DateTime(-_sys.maxint / 366 + 2, 1, 1)
/usr/lib/python2.7/dist-packages/psycopg2/__init__.py:67: DeprecationWarning: CObject type is not supported in 3.x. Please use capsule objects instead.
  from psycopg2._psycopg import BINARY, NUMBER, STRING, DATETIME, ROWID
etc/python/grass/temporal/abstract_dataset.py:571: DeprecationWarning: Overriding __eq__ blocks inheritance of __hash__ in 3.x
  class AbstractDatasetComparisonKeyStartTime(object):
etc/python/grass/temporal/abstract_dataset.py:621: DeprecationWarning: Overriding __eq__ blocks inheritance of __hash__ in 3.x
  class AbstractDatasetComparisonKeyEndTime(object):
/usr/lib/python2.7/dist-packages/dateutil/relativedelta.py:15: DeprecationWarning: Overriding __eq__ blocks inheritance of __hash__ in 3.x
  class weekday(object):
/usr/lib/python2.7/dist-packages/dateutil/tz.py:31: DeprecationWarning: Overriding __eq__ blocks inheritance of __hash__ in 3.x
  class tzutc(datetime.tzinfo):
/usr/lib/python2.7/dist-packages/dateutil/tz.py:54: DeprecationWarning: Overriding __eq__ blocks inheritance of __hash__ in 3.x
  class tzoffset(datetime.tzinfo):
/usr/lib/python2.7/dist-packages/dateutil/tz.py:83: DeprecationWarning: Overriding __eq__ blocks inheritance of __hash__ in 3.x
  class tzlocal(datetime.tzinfo):
/usr/lib/python2.7/dist-packages/dateutil/tz.py:152: DeprecationWarning: Overriding __eq__ blocks inheritance of __hash__ in 3.x
  class _ttinfo(object):
/usr/lib/python2.7/dist-packages/dateutil/tz.py:191: DeprecationWarning: Overriding __eq__ blocks inheritance of __hash__ in 3.x
  class tzfile(datetime.tzinfo):
/usr/lib/python2.7/dist-packages/dateutil/tz.py:475: DeprecationWarning: Overriding __eq__ blocks inheritance of __hash__ in 3.x
  class tzrange(datetime.tzinfo):
Default TGIS driver / database set to:
driver: sqlite
database:
/grassdata/tests-grassdata/piemonte_utm32_wgs84_grass7/__temporal_t_rast_algebra_test_raster_algebra_granularity_fails/tgis/sqlite.db
etc/python/grass/temporal/core.py:544: DeprecationWarning: dict.has_key() not supported in 3.x; use the in operator
  if grassenv.has_key("TGIS_DISABLE_MAPSET_CHECK"):
etc/python/grass/temporal/core.py:550: DeprecationWarning: dict.has_key() not supported in 3.x; use the in operator
  if grassenv.has_key("TGIS_DISABLE_TIMESTAMP_WRITE"):
Creating temporal database:
/grassdata/tests-grassdata/piemonte_utm32_wgs84_grass7/__temporal_t_rast_algebra_test_raster_algebra_granularity_fails/tgis/sqlite.db
/usr/lib/python2.7/xml/etree/ElementTree.py:1627: DeprecationWarning: This method of XMLParser is deprecated.  Define doctype() method on the TreeBuilder target.
  DeprecationWarning,
Gathering map information...
   0% 100%
Registering maps in the space time raster dataset...
   0%Updating space time raster dataset...
 100%
Gathering map information...
   0% 100%
Registering maps in the space time raster dataset...
   0%Updating space time raster dataset...
 100%
.E
======================================================================
ERROR: tearDownClass (__main__.TestTRastAlgebraGranularityFails)
----------------------------------------------------------------------
Traceback (most recent call last):
  File "temporal/t.rast.algebra/testsuite/test_raster_algebra_granularity_fails.py", line 44, in tearDownClass
    cls.runModule("t.remove", flags="rf", inputs="A", quiet=True)
  File "etc/python/grass/gunittest/case.py", line 953, in runModule
    errors=errors)
CalledModuleError: Module run 1 t.remove ended with error
Process ended with non-zero return code t.remove(inputs=['A'], type='strds', flags=u'rf', quiet=True). See the following errors:
Traceback (most recent call last):
  File "scripts/t.remove", line 159, in <module>
    tgis.profile_function(main)
  File "etc/python/grass/temporal/core.py", line 73, in profile_function
    func()
  File "scripts/t.remove", line 143, in main
    remove(type="rast", name=",".join(name_list), run_=True)
  File "etc/python/grass/pygrass/modules/interface/module.py", line 594, in __call__
    self.inputs[key].value = val
  File "etc/python/grass/pygrass/modules/interface/parameter.py", line 183, in _set_value
    self._value, self._rawvalue = _check_value(self, value)
  File "etc/python/grass/pygrass/modules/interface/parameter.py", line 91, in _check_value
    raise ValueError(must_val % (param.name, param.values))
ValueError: The Parameter <type>, must be one of the following values: ['raster', '3draster', 'vector', 'oldvector', 'asciivector', 'labels', 'region', 'group', 'all']


----------------------------------------------------------------------
Ran 1 test in 4.396s
FAILED (errors=1)