test_rinpoly

./raster/r.in.poly – test_rinpoly

Test failed

Test filetest_rinpoly
Testsuite./raster/r.in.poly
StatusFAILED
Return code1
Number of tests1
Successful tests0
Failed tests1
Percent successful0%
Test duration0:00:01.059049

Supplementary files

Standard error output (stderr)

etc/python/grass/lib/gis.py:807: DeprecationWarning: classic int division
  ('__val', c_ulong * (1024 / (8 * sizeof(c_ulong)))),
/usr/lib/python2.7/xml/etree/ElementTree.py:1627: DeprecationWarning: This method of XMLParser is deprecated.  Define doctype() method on the TreeBuilder target.
  DeprecationWarning,
E
======================================================================
ERROR: setUpClass (__main__.TestRInPoly)
----------------------------------------------------------------------
Traceback (most recent call last):
  File "raster/r.in.poly/testsuite/test_rinpoly.py", line 34, in setUpClass
    cls.runModule('g.region', rast='elevation')
  File "etc/python/grass/gunittest/case.py", line 932, in runModule
    module = _module_from_parameters(module, **kwargs)
  File "etc/python/grass/gunittest/case.py", line 1060, in _module_from_parameters
    module = SimpleModule(module, **kwargs)
  File "etc/python/grass/gunittest/gmodules.py", line 54, in __init__
    Module.__init__(self, cmd, *args, **kargs)
  File "etc/python/grass/pygrass/modules/interface/module.py", line 556, in __init__
    self.__call__(*args, **kargs)
  File "etc/python/grass/pygrass/modules/interface/module.py", line 602, in __call__
    raise ParameterError('%s is not a valid parameter.' % key)
ParameterError: rast is not a valid parameter.

----------------------------------------------------------------------
Ran 0 tests in 0.063s
FAILED (errors=1)