unittests_temporal_raster_conditionals

./lib/python/temporal – unittests_temporal_raster_conditionals

Test failed

Test fileunittests_temporal_raster_conditionals
Testsuite./lib/python/temporal
StatusFAILED
Return code1
Number of tests26
Successful tests0
Failed tests30
Percent successful0%
Test duration0:01:11.837989

Supplementary files

Standard error output (stderr)

... (lines omitted)
    self.runModule("t.remove", flags="rf", inputs="R", quiet=True)
  File "etc/python/grass/gunittest/case.py", line 953, in runModule
    errors=errors)
CalledModuleError: Module run 1 t.remove ended with error
Process ended with non-zero return code t.remove(inputs=['R'], type='strds', flags=u'rf', quiet=True). See the following errors:
Traceback (most recent call last):
  File "scripts/t.remove", line 159, in <module>
    tgis.profile_function(main)
  File "etc/python/grass/temporal/core.py", line 73, in profile_function
    func()
  File "scripts/t.remove", line 143, in main
    remove(type="rast", name=",".join(name_list), run_=True)
  File "etc/python/grass/pygrass/modules/interface/module.py", line 594, in __call__
    self.inputs[key].value = val
  File "etc/python/grass/pygrass/modules/interface/parameter.py", line 183, in _set_value
    self._value, self._rawvalue = _check_value(self, value)
  File "etc/python/grass/pygrass/modules/interface/parameter.py", line 91, in _check_value
    raise ValueError(must_val % (param.name, param.values))
ValueError: The Parameter <type>, must be one of the following values: ['raster', '3draster', 'vector', 'oldvector', 'asciivector', 'labels', 'region', 'group', 'all']


======================================================================
ERROR: tearDownClass (__main__.TestTemporalRasterAlgebraConditionals)
----------------------------------------------------------------------
Traceback (most recent call last):
  File "lib/python/temporal/testsuite/unittests_temporal_raster_conditionals.py", line 64, in tearDownClass
    cls.runModule("t.remove", flags="rf", inputs="A,B,C,D", quiet=True)
  File "etc/python/grass/gunittest/case.py", line 953, in runModule
    errors=errors)
CalledModuleError: Module run 1 t.remove ended with error
Process ended with non-zero return code t.remove(inputs=['A,B,C,D'], type='strds', flags=u'rf', quiet=True). See the following errors:
Traceback (most recent call last):
  File "scripts/t.remove", line 159, in <module>
    tgis.profile_function(main)
  File "etc/python/grass/temporal/core.py", line 73, in profile_function
    func()
  File "scripts/t.remove", line 143, in main
    remove(type="rast", name=",".join(name_list), run_=True)
  File "etc/python/grass/pygrass/modules/interface/module.py", line 594, in __call__
    self.inputs[key].value = val
  File "etc/python/grass/pygrass/modules/interface/parameter.py", line 183, in _set_value
    self._value, self._rawvalue = _check_value(self, value)
  File "etc/python/grass/pygrass/modules/interface/parameter.py", line 91, in _check_value
    raise ValueError(must_val % (param.name, param.values))
ValueError: The Parameter <type>, must be one of the following values: ['raster', '3draster', 'vector', 'oldvector', 'asciivector', 'labels', 'region', 'group', 'all']


----------------------------------------------------------------------
Ran 26 tests in 70.574s
FAILED (errors=30)