test_assertions_vect

./lib/python/gunittest – test_assertions_vect

Test failed

Test filetest_assertions_vect
Testsuite./lib/python/gunittest
StatusFAILED
Return code1
Number of tests11
Successful tests4
Failed tests8
Percent successful36%
Test duration0:00:02.710239

Supplementary files

Standard error output (stderr)

... (lines omitted)
ERROR: test_assertVectorInfoEqualsVectorInfo (__main__.TestVectorInfoAssertions)
----------------------------------------------------------------------
Traceback (most recent call last):
  File "lib/python/gunittest/testsuite/test_assertions_vect.py", line 115, in test_assertVectorInfoEqualsVectorInfo
    self.assertVectorInfoEqualsVectorInfo('bridges', 'bridges', precision=0.00000001)
  File "etc/python/grass/gunittest/case.py", line 354, in assertVectorInfoEqualsVectorInfo
    self.runModule(module)
  File "etc/python/grass/gunittest/case.py", line 953, in runModule
    errors=errors)
CalledModuleError: Module run 1 v.info ended with error
Process ended with non-zero return code v.info(map='bridges', layer='1', flags=u't'). See the following errors:
ERROR: Vector map <bridges> not found

See available vector maps:
aree_edificate
aree_inondabili
aree_montane
autostrade
beni_ambientali
beni_urbanistici
confini_comunali
confini_provinciali
corine1990
edifici_osm
ferrovie
fiumi
galasso
isolinee
laghi
lst_2010_average_piemonte_box
natura2000_sic
natura2000_sir
natura2000_zps
parchi
punti_quotati
simple_vector_map_base
simple_vector_map_base_geom
simple_vector_map_different_header
simple_vector_map_imported_base
simple_vector_map_modified_geom
stazioni_ferroviarie
strade_comunali
strade_provinciali
strade_statali
tmp___main___TestVectorGeometryAssertions_test_assertVectorEqualsAscii_by_import_import_ascii_vector_assertVectorEqualsAscii_reference_a989f487db875cdb1530b21d81b2c1d1


----------------------------------------------------------------------
Ran 11 tests in 1.697s
FAILED (errors=8)