test_profile_ncspm stderr

etc/python/grass/lib/gis.py:803: DeprecationWarning: classic int division
  ('__val', c_ulong * (1024 / (8 * sizeof(c_ulong)))),
ERROR: Raster map <elevation> not found
/usr/lib/python2.7/xml/etree/ElementTree.py:1627: DeprecationWarning: This method of XMLParser is deprecated.  Define doctype() method on the TreeBuilder target.
  DeprecationWarning,
FFFFFF
======================================================================
FAIL: test_profile_default (__main__.TestProfileNCSPM)
----------------------------------------------------------------------
Traceback (most recent call last):
  File "raster/r.profile/testsuite/test_profile_ncspm.py", line 146, in test_profile_default
    self.assertModule(rprofile)
  File "etc/python/grass/gunittest/case.py", line 1016, in assertModule
    self.fail(self._formatMessage(msg, stdmsg))
AssertionError: Running <r.profile> module ended with non-zero return code (1)
Called: r.profile(input='elevation', output='-', coordinates=[637656, 224222, 637766, 224289], null='*')
See the folowing errors:
Using resolution: 250 [meters]
ERROR: Raster map <elevation> not found


======================================================================
FAIL: test_profile_directions (__main__.TestProfileNCSPM)
----------------------------------------------------------------------
Traceback (most recent call last):
  File "raster/r.profile/testsuite/test_profile_ncspm.py", line 185, in test_profile_directions
    self.assertModule(rprofile)
  File "etc/python/grass/gunittest/case.py", line 1016, in assertModule
    self.fail(self._formatMessage(msg, stdmsg))
AssertionError: Running <r.profile> module ended with non-zero return code (1)
Called: r.profile(input='elevation', output='-', coordinates=[635747, 222664, 635673, 222717, 635563, 222634, 635641, 222543, 635747, 222664], null='*', flags=u'g')
See the folowing errors:
Using resolution: 250 [meters]
ERROR: Raster map <elevation> not found


======================================================================
FAIL: test_profile_m (__main__.TestProfileNCSPM)
----------------------------------------------------------------------
Traceback (most recent call last):
  File "raster/r.profile/testsuite/test_profile_ncspm.py", line 154, in test_profile_m
    self.assertModule(rprofile)
  File "etc/python/grass/gunittest/case.py", line 1016, in assertModule
    self.fail(self._formatMessage(msg, stdmsg))
AssertionError: Running <r.profile> module ended with non-zero return code (1)
Called: r.profile(input='elevation', output='-', coordinates=[637656, 224222, 637766, 224289], null='*', units='meters')
See the folowing errors:
Using resolution: 250 [meters]
ERROR: Raster map <elevation> not found


======================================================================
FAIL: test_profile_ne (__main__.TestProfileNCSPM)
----------------------------------------------------------------------
Traceback (most recent call last):
  File "raster/r.profile/testsuite/test_profile_ncspm.py", line 169, in test_profile_ne
    self.assertModule(rprofile)
  File "etc/python/grass/gunittest/case.py", line 1016, in assertModule
    self.fail(self._formatMessage(msg, stdmsg))
AssertionError: Running <r.profile> module ended with non-zero return code (1)
Called: r.profile(input='elevation', output='-', coordinates=[637656, 224222, 637766, 224289], null='*', flags=u'g')
See the folowing errors:
Using resolution: 250 [meters]
ERROR: Raster map <elevation> not found


======================================================================
FAIL: test_profile_region (__main__.TestProfileNCSPM)
----------------------------------------------------------------------
Traceback (most recent call last):
  File "raster/r.profile/testsuite/test_profile_ncspm.py", line 176, in test_profile_region
    self.assertModule(rprofile)
  File "etc/python/grass/gunittest/case.py", line 1016, in assertModule
    self.fail(self._formatMessage(msg, stdmsg))
AssertionError: Running <r.profile> module ended with non-zero return code (1)
Called: r.profile(input='elevation', output='-', coordinates=[644914, 224579, 644986, 224627, 645091, 224549], null='nodata')
See the folowing errors:
Using resolution: 250 [meters]
ERROR: Raster map <elevation> not found


======================================================================
FAIL: test_profile_resolution (__main__.TestProfileNCSPM)
----------------------------------------------------------------------
Traceback (most recent call last):
  File "raster/r.profile/testsuite/test_profile_ncspm.py", line 161, in test_profile_resolution
    self.assertModule(rprofile)
  File "etc/python/grass/gunittest/case.py", line 1016, in assertModule
    self.fail(self._formatMessage(msg, stdmsg))
AssertionError: Running <r.profile> module ended with non-zero return code (1)
Called: r.profile(input='elevation', output='-', coordinates=[637656, 224222, 637766, 224289], resolution=25.0, null='*')
See the folowing errors:
Using resolution: 25 [meters]
ERROR: Raster map <elevation> not found


----------------------------------------------------------------------
Ran 6 tests in 0.158s
FAILED (failures=6)