test_raster

./lib/python/pygrass/raster – test_raster

Test failed

Test filetest_raster
Testsuite./lib/python/pygrass/raster
StatusFAILED
Return code1
Number of tests3
Successful tests0
Failed tests3
Percent successful0%
Test duration0:00:01.259277

Supplementary files

Standard error output (stderr)

etc/python/grass/lib/gis.py:803: DeprecationWarning: classic int division
  ('__val', c_ulong * (1024 / (8 * sizeof(c_ulong)))),
/usr/lib/python2.7/dist-packages/numpy/core/__init__.py:6: DeprecationWarning: CObject type is not supported in 3.x. Please use capsule objects instead.
  from . import multiarray
/usr/lib/python2.7/dist-packages/numpy/core/__init__.py:7: DeprecationWarning: CObject type is not supported in 3.x. Please use capsule objects instead.
  from . import umath
EEE
======================================================================
ERROR: test_isopen (__main__.RasterRowTestCate)
----------------------------------------------------------------------
Traceback (most recent call last):
  File "lib/python/pygrass/raster/testsuite/test_raster.py", line 27, in test_isopen
    r.open()
  File "etc/python/grass/pygrass/raster/__init__.py", line 201, in open
    raise OpenError(str_err)
OpenError: The map does not exist, I can't open in 'r' mode

======================================================================
ERROR: test_name (__main__.RasterRowTestCate)
----------------------------------------------------------------------
Traceback (most recent call last):
  File "lib/python/pygrass/raster/testsuite/test_raster.py", line 33, in test_name
    r.open()
  File "etc/python/grass/pygrass/raster/__init__.py", line 201, in open
    raise OpenError(str_err)
OpenError: The map does not exist, I can't open in 'r' mode

======================================================================
ERROR: test_type (__main__.RasterRowTestCate)
----------------------------------------------------------------------
Traceback (most recent call last):
  File "lib/python/pygrass/raster/testsuite/test_raster.py", line 20, in test_type
    r.open()
  File "etc/python/grass/pygrass/raster/__init__.py", line 201, in open
    raise OpenError(str_err)
OpenError: The map does not exist, I can't open in 'r' mode

----------------------------------------------------------------------
Ran 3 tests in 0.001s
FAILED (errors=3)